{"text_format":"1","workbook":"xlsx","n_sheets":28,"sheets":["12 BB","TUTORIAL","FACE","ANTICIPATORY","help","det.sal input","taxplanning","print","INVEST","CUSTOMISE","PERSONAL"," MONH SPL print","ARR MONH SPLIT","new form 16"," Form 16 NEW REGIME","ARREAR SPLIT","MEDI INS OTHER DED","DA ALTER","tds det","new statement","new statement for PRINT","new statement (2)","Form 10E NEW REG","Form 10E","arrear det","Calc","Data","SAVEHELP"],"not_rendered":{"charts":0,"images":28,"macros":1,"external_links":2,"defined_names":92,"comments":15,"pivot_tables":0},"unopened":[],"bounds":{"document_bytes":16777216,"sheet_cells":100000,"rows_first":2000,"rows_last":500,"rows_between":2000,"halvings":0,"cell_chars":16384,"cell_head_chars":4096},"cells_cut":0,"cells_raw":0,"read":"whole","date_system":"1900"}

{"sheet":"12 BB","index":0,"n_rows":99,"n_cols":7,"rows_kept":99,"cut":false,"hidden":false,"merged":[[79,1,79,4],[0,1,0,4],[6,0,6,4],[8,1,8,2],[9,1,9,2],[53,3,53,4],[40,1,40,2],[41,1,41,2],[42,1,42,2],[43,1,43,2],[44,1,44,2],[24,1,24,2],[25,1,25,2],[47,1,47,2],[48,1,48,2],[28,1,28,2],[52,3,52,4],[54,3,54,4],[1,0,1,4],[3,3,3,4],[4,3,4,4],[5,3,5,4],[5,0,5,2],[45,1,45,2],[46,1,46,2],[21,1,21,2],[22,1,22,2],[23,1,23,2],[26,1,26,2],[27,1,27,2],[49,1,49,2],[50,0,50,4],[51,0,51,4],[18,1,18,2],[19,1,19,2],[20,1,20,2],[7,0,7,4],[10,1,10,2],[11,1,11,2],[12,1,12,2],[13,1,13,2],[14,1,14,2],[15,1,15,2],[16,1,16,2],[17,1,17,2]]}
[{"$f":"D4","v":", , , "},"FORM NO.12BB (See rule 26C)"]
[{"$f":"B1","v":"FORM NO.12BB (See rule 26C)"}]
[]
["1. Name and address of the employee: ",null,null,{"$f":"PERSONAL!H4&\", \"&PERSONAL!H6&\", \"&CUSTOMISE!H22&\", \"&CUSTOMISE!H23","v":", , , "}]
["2. Permanent Account Number of the employee: ",null,null,{"$f":"PERSONAL!H7","v":0}]
["3. Financial year:",null,null,"2023-24"]
[]
["Details of claims and evidence thereof",null,null,null,null,null,"ഈ ഫോമിന്റെ ഡാറ്റാ എന്‍ട്രി "]
["Sl No.","Nature of claim",null,"Amount (Rs.)","Evidence / particulars",null,"നടത്താനോ നടത്തിയത് തിരുത്താനോ "]
[1,2,null,3,4,null,"മുകളിലെ ബട്ടണില്‍ ക്ലിക്ക് ചെയ്യുക "]
[1,"House Rent Allowance:"]
[null,"(i) Rent paid to the landlord",null,{"$f":"PERSONAL!H9","v":0},{"$f":"IF(D12=\"NIL\",\"\",E93)","v":0}]
[null,"(ii) Name of the landlord",null,null,{"$f":"IF(D12=\"NIL\",\"\",E94)","v":0}]
[null,"(iii) Address of the landlord",null,null,{"$f":"IF(D12=\"NIL\",\"\",E95)","v":0}]
[null,"(iv) PAN of the landlord",null,null,{"$f":"IF(D12=\"NIL\",\"\",E96)","v":0}]
[null,"Note: Permanent Account Number shall be furnished if the aggregate rent paid during the previous year exceeds one lakh rupees"]
[2,"Leave travel concessions or assistance",null,{"$f":"D97","v":0},{"$f":"E97","v":0}]
[3,"Deduction of interest on borrowing: (Housing loan)"]
[null,"(i) Interest payable/paid to the lender",null,{"$f":"('new statement'!O23)*-1+'new statement'!O53","v":0},{"$f":"IF(D19=0,\"\",\"Certificate by the Authority/ Institution\")","v":""}]
[null,"(ii) Name of the lender",null,null,{"$f":"IF(D19=0,\"\",E86)","v":""}]
[null,"(iii) Address of the lender",null,null,{"$f":"IF(D19=0,\"\",E87)","v":""},null,"PDF facility available only for EXCEL 10 or above versions"]
[null,"(iv) Permanent Account Number of the lender",null,null,{"$f":"IF(D19=0,\"\",E88)","v":""}]
[null,"Deduction of interest on borrowing: (Education loan)",null,{"$f":"'new statement'!O52","v":0}]
[null,"(i) Interest payable/paid to the lender",null,null,{"$f":"IF(D23=0,\"\",\"Certificate by the Authority/ Institution\")","v":""}]
[null,"(ii) Name of the lender",null,null,{"$f":"IF(D23=0,\"\",E90)","v":""}]
[null,"(iii) Address of the lender",null,null,{"$f":"IF(D23=0,\"\",E91)","v":""}]
[null,"(iv) Permanent Account Number of the lender",null,null,{"$f":"IF(D23=0,\"\",E92)","v":""}]
[4,"Deduction under Chapter VI-A (A)  Section 80C,80CCC and 80CCD"]
[null,"     (i) Section 80C"]
[null,"(a)","PF,SLI, GI",{"$f":"'new statement'!M96+'new statement'!N96+'new statement'!O96","v":0},"Salary deduction only"]
[null,"(b)","Tax saving Fixed deposit",{"$f":"INVEST!F8","v":0},"Fixed deposit receipt"]
[null,"(c) ","LIC/ PLI Salary deduction",{"$f":"'new statement'!P96","v":0},"Salary deduction only"]
[null,"(d)","LIC/PLI other than salary deduction",{"$f":"'new statement'!O35","v":0},"Premium paid Certificates"]
[null,"(e)",{"$f":"'det.sal input'!R6&\" +  \"&'det.sal input'!T6","v":"? +  ?"},{"$f":"'new statement'!R96","v":0},"Salary deduction only"]
[null,"(f)","NSC VIII th issue",{"$f":"'new statement'!O37","v":0},"NSC Certificate photo copy"]
[null,"(g)","Public Provident Fund (PPF)",{"$f":"'new statement'!O38","v":0},"Payment Slip copy"]
[null,"(h)","Ulip/ Tax saving mutual funds",{"$f":"'new statement'!O39","v":0},"Payment Slip copy"]
[null,"(i)","Tuition Fee",{"$f":"'new statement'!O40","v":0},"Receipts from the institution/College"]
[null,"(j)","Housing loan Principal repayment ",{"$f":"'new statement'!O41","v":0},"Annual statement  from bank"]
[null,"(k)",{"$f":"INVEST!E13","v":0},{"$f":"'new statement'!O42","v":0},"Certificate by the Authority/ Institution"]
[null,"    (ii)  Section 80CCC",null,{"$f":"INVEST!F6","v":0},"Premium payment slip copy"]
[null,"    (iii) Section 80CCD",null,{"$f":"'new statement'!T96+INVEST!F15","v":0},"Salary deduction/ Payment slip"]
[null,"(B) Other sections (80E, 80G, 80TTA, etc.) under Chapter VI-A."]
[null,"(i) Investment in Rajiv Gandhi Equity Savings Scheme 80CCG",null,{"$f":"'new statement'!O48","v":0},"Copy of Certificate/Receipt issued"]
[null,"(ii)Mediclaim 80 D",null,{"$f":"'new statement'!O49","v":0},"Certificate of Insurance Company"]
[null,"(iii) Medical treatment of handicapped dependents 80 DD",null,{"$f":"'new statement'!O50","v":0},"Medical board 10 (IA) Certificate"]
[null,"(iv) For medical treatment of specified diseases of self/dependent 80 DDB",null,{"$f":"'new statement'!O51","v":0},"10 I Certificates and bills of exp."]
[null,"(v) Educational Loan Interest 80 E",null,{"$f":"'new statement'!O52","v":0},"Certificate of Bank"]
[null,"(vi) Donation to special funds 80 G",null,{"$f":"'new statement'!O55","v":0},"Collected and remitted by DDO"]
[null,"(vi) Dedution for differently abled Employees( 80U)",null,{"$f":"'new statement'!O56","v":0},"Medical board Certificate"]
["Verification"]
[{"$f":"\"I, \"&PERSONAL!H4&\" ,son/daughter of \"&E84& \" do hereby certify that the information given above is complete and correct.\"","v":"I,  ,son/daughter of  do hereby certify that the information given above is complete and correct."}]
["Place",{"$f":"CUSTOMISE!H23","v":0}]
["Date",{"$f":"'new statement'!D75","v":"05/02/2024"},null,{"$f":"\"Signature of \"&PERSONAL!H4","v":"Signature of "}]
[{"$f":"\"Designation:    \"&PERSONAL!H6","v":"Designation:    "},null,null,{"$f":"PERSONAL!H4","v":0}]
[]
[]
[]
[]
[]
[]
[]
[]
[]
[]
[]
[]
[]
[]
[]
[]
[]
[]
[]
[]
[]
[null,"If you want to take printout of Form 12 BB, also fill the following details "]
[null,"DDO ക്ക് സമര്‍പ്പിക്കേണ്ട ഫോം 12 BB ഈ സംവിധാനത്തിലൂടെ പ്രിന്‍റ് എടുക്കാന്‍ ഉദ്ദേശിക്കുന്നുവെങ്കില്‍ മാത്രം ചുവടെ കാണുന്ന"]
[null,"ചോദ്യങ്ങള്‍ക്ക് ഉത്തരം നല്‍കുക - സാധാരണ ഫോമുകള്‍ക്കു പുറമേ ഇത്തവണ സമര്‍പ്പിക്കണമെന്ന് പറയുന്ന ഫോം ആണ് ഇത് "]
[null,"FORM 12 BB DATA ENTRY FIELD (യഥാര്‍ത്ഥ print പിന്നീട് ലഭിക്കും )"]
[null,"Sl No.","Show answers to Questions to the following questions","Amount","Document submitted before DDO as Proof "]
[null,"ക്രമനമ്പര്‍","ചുവടെ ചോദ്യങ്ങള്‍ കാണുന്നവക്ക് മാത്രം ഉത്തരം നല്‍കുക ഒഴിഞ്ഞു കിടക്കുന്ന ചോദ്യനമ്പറുകള്‍ അവഗണിക്കുക  ","അടച്ച തുക ","ബന്ധപ്പെട്ട വിഷയത്തിന്‍റെ തെളിവിനായി സമര്‍പ്പിക്കാന്‍ ഉദ്ദേശിക്കുന്ന രേഖ "]
[null,1,"Your Name",null,{"$f":"PERSONAL!H4","v":0}]
[null,2,"Your Father's Name"]
[null,3,{"$f":"IF(PERSONAL!H19=\"NO\",\"\",\"Housing Loan Interest + Principal payment Total\")","v":""},{"$f":"INVEST!F12+INVEST!F17","v":0},{"$f":"IF(C85=\"\",\"\",\"Certificate of Bank\")","v":""}]
[null,"a",{"$f":"IF(PERSONAL!H19=\"NO\",\"\",\"Name of the bank\")","v":""}]
[null,"b",{"$f":"IF(PERSONAL!H19=\"NO\",\"\",\"Address of the bank\")","v":""}]
[null,"c",{"$f":"IF(PERSONAL!H19=\"NO\",\"\",\"Permanent Account Number of Bank\")","v":""}]
[null,4,{"$f":"IF($D$89=0,\"\",\"Education loan Interest payment\")","v":""},{"$f":"'new statement'!O52","v":0},{"$f":"IF(C89=\"\",\"\",\"Certificate of Bank\")","v":""}]
[null,"a",{"$f":"IF($D$89=0,\"\",\" Name of the bank\")","v":""}]
[null,"b",{"$f":"IF($D$89=0,\"\",\"Address of the bank\")","v":""}]
[null,"c",{"$f":"IF($D$89=0,\"\",\" Permanent Account Number of Bank\")","v":""}]
[null,5,{"$f":"IF(D93=0,\"\",\" Rent paid to the House owner\")","v":""},{"$f":"D12","v":0}]
[null,"a",{"$f":"IF(D93=0,\"\",\" Name of the House owner\")","v":""}]
[null,"b",{"$f":"IF(D93=0,\"\",\" Address of the House owner\")","v":""}]
[null,"c",{"$f":"IF(D93=0,\"\",\" PAN of House owner\")","v":""}]
[null,6,"Leave Travelling allowance actually spent (if any) (Show proof that the amount is actually spent)"]
[]
[null,"Scroll  mouse up to see the head of the table",null,"ഈ പട്ടികയുടെ തലക്കെട്ട്‌ കാണുന്നില്ലെങ്കില്‍ മൌസ് മുകളിലേക്ക് സ്ക്രോള്‍ ചെയ്യുക "]

{"sheet":"TUTORIAL","index":1,"n_rows":33,"n_cols":17,"rows_kept":33,"cut":false,"hidden":false,"merged":[[25,5,25,6],[0,1,0,13],[1,1,2,4]]}
[null,null,null,null,null,null,null,null,null,null,null,null,null,null,null,null,"click me to SAVE and CLOSE the app"]
[null,null,null,null,null,null,null,"കേരള DA  സ്കെയില്‍ വാങ്ങുന്നവരും UGC  അല്ലാത്ത ജീവനക്കാരും വലതു icon  ക്ലിക്ക്  ചെയ്യുക "]
[null,null,null,null,null,null,1,"Kerala DA % or Employees other than UGC scale, click the right side icon"]
[null,null,null,null,null,null,null,"UGC  Scale  ജീവനക്കാര്‍ വലതു icon ക്ലിക്ക് ചെയ്യുക "]
[null,null,null,null,null,null,2,"UGC Scale Emloyees , click the right side icon"]
[null,null,null,null,null,null,null,"നികുതി സംബന്ധമായ കുറിപ്പ് ഡൌണ്‍ലോഡ് ( 2 മിനിറ്റ് ക്ഷമയോടെ കാക്കുക ) "]
[null,null,null,null,null,null,3,"To download notes on Income tax calculation 2024  (may take 2 minute)"]
[null,null,null,null,null,null,null,"ഈ സോഫ്റ്റ്‌വെയര്‍ ന്‍റെ ഏറ്റവും പുതിയ പതിപ്പ് ഡൌണ്‍ലോഡ് ചെയ്യാന്‍ "]
[null,null,null,null,null,null,4,"To Visit blog to download latest version of the programme"]
[]
[null,{"$f":"FACE!B1&\" of the programme \"&FACE!D1","v":"Date of release of the programme 2023 December 21"}]
[]
[]
[]
[]
[]
[]
[]
[]
[]
[]
[]
[]
[null,null,"  "]
[]
[]
[]
[]
[]
[]
[]
[null,null,"ഈ പ്രോഗ്രാം കൂടുതല്‍ സാദ്ധ്യതകള്‍ നല്‍കി പരിഷരിച്ച തീയതി "]
[null,null,{"$f":"FACE!D1","v":"2023 December 21"},null,null,{"$f":"FACE!F1","v":"00:00:00"}]

{"sheet":"FACE","index":2,"n_rows":102,"n_cols":15,"rows_kept":102,"cut":false,"hidden":false,"merged":[[11,12,13,16],[8,5,8,8],[0,3,0,4],[3,2,3,8],[5,2,5,8],[2,2,2,8],[6,3,6,8],[10,1,10,16]]}
["`","Date of release",null,"2023 December 21"]
[null,null,null,null,null,null,null,null,"Assessment Year 2024-25 [financial year 2023-24]",null,null,null,null,null,"click to close"]
[null,null,"babu vadukkumchery's two in one income tax calculator "]
[null,null,"  ECTAX income tax calculator- 2024"]
[null,null,null,null,null,null,null,null,"Income Tax statement, Form 12 BB"]
[null,null,"for UGC scale College teachers and Kerala Govt/ Private employees (malayalm menu based)"]
[]
[]
[null,null,null,null,null,"Babu V A, commerce teacher, KNMVHSS Vatanappally"]
[null,null,null,null,null,null,"Only Windows support ",null,"PDF Saving facility  "]
[]
[null,null,null,null,null,null,null,null,null,null,null,null,{"$f":"IF(PERSONAL!H4=\"\",\"\",\"Dear friend \"&PERSONAL!H4&\",  TO PRINT / VIEW YOUR CREATED FILE, DONOT CLICK ON START BUTTON, BUT JUST CLICK ON THESE LINES. \")","v":""}]
[]
[]
[]
[]
[]
[null,null,null,null,null,null,null,null,"Email: babuvadukkumchery@gmail.com"]
[null,null,null,null,null,null,null,null,"blog: babuvadukkumchery.blogspot.com"]
[]
[]
[]
[]
[]
[]
[]
[]
[]
[]
[]
[]
[]
[]
[]
[]
[]
[]
[]
[]
[]
[]
[]
[]
[]
[]
[]
[]
[]
[]
[]
[]
[]
[]
[]
[]
[]
[]
[]
[]
[]
[]
[]
[]
[]
[]
[]
[]
[]
[]
[]
[]
[]
[]
[]
[]
[]
[]
[]
[]
[]
[]
[]
[]
[]
[]
[]
[]
[]
[]
[]
[]
[]
[]
[]
[]
[]
[]
[]
[]
[]
[]
[{"$f":"PERSONAL!$I$479","v":0}]

{"sheet":"ANTICIPATORY","index":3,"n_rows":260,"n_cols":32,"rows_kept":260,"cut":false,"hidden":true,"merged":[[69,17,69,18],[69,2,69,16],[87,1,87,2],[88,1,88,2],[89,1,89,2],[90,1,91,1],[92,1,92,2],[93,1,93,2],[82,1,82,2],[76,1,76,2],[77,1,77,2],[78,1,78,2],[79,1,79,2],[80,1,80,2],[81,1,81,2],[70,15,70,19],[72,14,72,19],[73,6,73,15],[74,1,74,19],[75,3,75,11],[75,12,75,19],[82,22,82,27],[83,1,83,2],[83,22,83,26],[84,0,94,0],[84,1,84,2],[84,22,84,28],[85,1,85,2],[85,22,85,27],[86,1,86,2],[94,1,94,2],[67,2,67,12],[67,13,67,16],[67,17,67,18],[68,2,68,12],[68,13,68,16],[68,17,68,18],[64,2,64,10],[64,17,64,18],[65,2,65,12],[65,17,65,18],[66,2,66,16],[66,17,66,18],[61,2,61,12],[61,17,61,18],[62,2,62,12],[62,17,62,18],[63,2,63,15],[63,17,63,18],[57,17,57,18],[58,2,58,15],[58,17,58,18],[59,2,59,16],[59,17,59,18],[60,2,60,16],[60,17,60,18],[54,3,54,12],[54,14,54,15],[54,17,54,18],[55,14,55,15],[55,17,55,18],[56,2,56,16],[56,17,56,18],[51,3,51,12],[51,14,51,15],[51,17,51,18],[52,3,52,12],[52,14,52,15],[53,3,53,12],[53,14,53,15],[53,17,53,18],[48,17,48,18],[49,3,49,12],[49,14,49,15],[49,17,49,18],[50,3,50,13],[50,14,50,15],[46,3,46,12],[46,14,46,15],[47,3,47,12],[47,14,47,15],[48,3,48,12],[48,14,48,15],[43,22,43,25],[44,2,44,13],[44,14,44,15],[44,17,44,18],[45,3,45,12],[45,14,45,15],[45,17,45,18],[42,2,42,12],[42,14,42,15],[42,17,42,18],[43,2,43,12],[43,14,43,15],[43,17,43,18],[39,3,39,12],[39,14,39,15],[40,3,40,12],[40,14,40,15],[40,17,40,18],[41,3,41,13],[41,14,41,15],[36,3,36,12],[36,14,36,15],[37,3,37,12],[37,14,37,15],[37,22,37,25],[38,3,38,12],[38,14,38,15],[34,3,34,12],[34,14,34,15],[34,17,34,18],[34,22,34,25],[35,3,35,13],[35,14,35,15],[31,22,31,25],[32,3,32,12],[32,14,32,15],[32,17,32,18],[32,22,32,25],[33,3,33,12],[33,14,33,15],[28,1,34,1],[28,17,28,19],[29,3,29,12],[29,14,29,15],[29,17,29,18],[29,22,29,25],[30,14,30,15],[31,3,31,12],[31,14,31,15],[31,17,31,18],[25,14,25,15],[25,17,25,18],[26,2,26,15],[26,17,26,18],[27,2,27,12],[27,14,27,16],[27,17,27,19],[22,2,22,13],[22,14,22,15],[22,17,22,18],[23,2,23,13],[23,14,23,15],[24,14,24,15],[19,2,19,12],[19,17,19,18],[20,2,20,12],[20,17,20,18],[21,2,21,15],[21,17,21,18],[15,17,15,18],[16,2,16,13],[16,17,16,18],[17,2,17,12],[17,17,17,18],[18,10,18,14],[18,17,18,18],[12,1,16,1],[13,3,13,12],[13,14,13,15],[14,3,14,11],[14,14,14,15],[15,3,15,12],[15,14,15,15],[5,5,5,8],[6,1,11,1],[6,3,6,15],[6,17,6,18],[7,3,7,15],[7,17,7,18],[8,3,8,15],[8,17,8,18],[11,3,11,15],[11,17,11,18],[0,1,0,19],[0,20,0,23],[1,1,1,19],[2,1,2,19],[3,1,3,18],[4,1,4,3],[4,5,4,13],[4,14,4,15],[4,16,4,18],[4,20,6,23]]}
[null,"സാങ്കേതിക കാരണങ്ങളാലും ഡാറ്റാ എന്ട്രി നടത്തുന്ന സന്ദര്‍ഭങ്ങളില്‍ തെറ്റുകള്‍ വരാനിടയുള്ളതിനാലും വസ്തുതകള്‍ ശരിയാണെന്ന് കണക്കു കൂട്ടി ഉറപ്പു വരുത്തുക. മൌസ് സ്ക്രോള്‍ ചെയ്ത് മുകള്‍ ഭാഗവും താഴ് ഭാഗവും കാണാനാകും ",null,null,null,null,null,null,null,null,null,null,null,null,null,null,null,null,null,null,{"$f":"IF(PERSONAL!H9=\"\",\"\",IF(ANTICIPATORY!R16=\"nil\",\"വാടക വീട്ടില്‍ താമസിക്കുന്നവര്‍ക്കുള്ള ഇളവ് ലഭിക്കാന്‍ നല്‍കുന്ന വാടക ശമ്പളത്തിന്റെ 10% നു മേലെയായിരിക്കണം, താങ്കള്‍ക്ക് ഈ ആനുകൂല്യം ലഭിക്കില്ല  \",\"\"))","v":""}]
[null,{"$f":"\" ANTICIPATORY INCOME TAX STATEMENT-FINANCIAL YEAR 2018-19 (AY 19-20) \"&CUSTOMISE!H22","v":" ANTICIPATORY INCOME TAX STATEMENT-FINANCIAL YEAR 2018-19 (AY 19-20) "}]
[null,{"$f":"PERSONAL!H10","v":"SALARY"}]
[]
[null,"Name",null,null,null,{"$f":"PERSONAL!H4","v":0},null,null,null,null,null,null,null,null,"PAN :",null,{"$f":"PERSONAL!H7","v":0},null,null,null,{"$f":"IF(PERSONAL!H8=\"no\",\"\",IF('det.sal input'!AC39>'det.sal input'!AB38,\"You cannot claim for benifit of living in a rental home [HRA benifit], because rent paid amount is less than 10% of your salary\",\"\"))","v":""}]
[null,"Designation     ",null,null,null,{"$f":"PERSONAL!H6","v":0},null,null,null,null,null,{"$f":"PERSONAL!H5","v":"Below 60 Years"}]
[null,1,"a","Gross Salary (EXCLUDES INTEREST ON ARREAR,  Festival allowance, Bonus,Leave Surrender)(includes Salary, DA, HRA, CCA, Interim Relief, , DA Arrear, Pay Revision Arrear  etc)",null,null,null,null,null,null,null,null,null,null,null,null,":",{"$f":"L95-L90-L93-'arrear det'!K13","v":0},null,null,null,null,null,null,{"$f":"'det.sal input'!AF29","v":1}]
[null,null,"b","Leave Surrender",null,null,null,null,null,null,null,null,null,null,null,null,":",{"$f":"L93","v":0},null,null,"medical reimb actual",{"$f":"'det.sal input'!W28","v":0},15000,"excess=",{"$f":"IF(Y7=1,0,IF((V8-W8)>0,(V8-W8),0))","v":0}]
[null,null,"c","Festival Allowance / Bonus / Ex-gratia and incentive",null,null,null,null,null,null,null,null,null,null,null,null,":",{"$f":"L90","v":0},null,null,{"$f":"SUM(R7:S9)","v":0}]
[null,null,"d","Value of perquisites (Iincludes Employer's contribution to NPS, Medical reimb. Taxable portion)",null,null,null,null,null,null,null,null,null,null,null,null,":",null,{"$f":"'det.sal input'!W32+'det.sal input'!W33+V8","v":0},null,null,null,null,null,"IF((V8-W8)>0,(V8-W8),0))"]
[null,null,"e","Profits in lieu of salary (S17-3)",null,null,null,null,null,null,null,null,null,null,null,null,":",null,{"$f":"'det.sal input'!W34","v":0},null,null,{"$f":"PERSONAL!H8","v":"NO"}]
[null,null,"f ","Total Salary Income (a+b+c+d+e)",null,null,null,null,null,null,null,null,null,null,null,null,":",{"$f":"SUM(R7:S11)","v":0}]
[null,2,"Deduction towards rent paid ",null,null,null,null,{"$f":"IF(PERSONAL!H8=\"no\",\"(not available)\",\"(Least amount gets excemption)\")","v":"(not available)"}]
[null,null,"i)","Actual HRA Received relating to the period",null,null,":",null,null,null,null,null,null,":",{"$f":"IF(V11=\"NO\",\"\",'det.sal input'!AB40)","v":""}]
[null,null,"ii)","Actual Rent paid in excess 1/10th of the salary",null,null,null,null,null,null,null,null,{"$f":"IF(O15=0,\"NIL\",\"\")","v":""},":",{"$f":"IF(V11=\"NO\",\"\",IF(W15>Y15,W15-Y15,0))","v":""},null,null,null,null,null,null,"rent paid =",{"$f":"'det.sal input'!AB38","v":0},"1/10 of sal=",{"$f":"'det.sal input'!AC39","v":0},{"$f":"IF(W15>Y15,W15-Y15,0)","v":0}]
[null,null,"iii)","40% Salary ( For this salary means Basic + DA)",null,null,":",null,null,null,null,null,null,":",{"$f":"IF(V11=\"NO\",\"\",Y16)","v":""},null,null,{"$f":"IF(R17=0,\"NIL\",R17)","v":"NIL"},null,null,null,null,null,"40%sal =",{"$f":"ROUND(('det.sal input'!AB39*0.4),0)","v":0}]
[null,null,{"$f":"IF(PERSONAL!H8=\"no\",\"\",\" (Here, Salary means Basic+DA+AGP only, but include arrear/ surrender values relating to this period.) That is \"&'det.sal input'!R40&\"+\"&'det.sal input'!T40&\"+\"&'det.sal input'!W40&\"\")","v":""},null,null,null,null,null,null,null,null,null,null,null,null,null,":",{"$f":"MIN(O14:P16)","v":0}]
[null,3,"Balance ( 1- 2)",null,null,null,null,null,null,null,null,null,null,null,null,null,":",{"$f":"R12-R17","v":0}]
[null,4,{"$f":"\" Less Allowance to the extent exempt u/s10   \"","v":" Less Allowance to the extent exempt u/s10   "},null,null,null,null,null,null,null,{"$f":"INVEST!D28&\" + \"&INVEST!D29&\" + \"&INVEST!D30&\" + \"&INVEST!D31","v":" +  +  + "},null,null,null,null,{"$f":"INVEST!F28+INVEST!F29+INVEST!F30+INVEST!F31","v":0},null,{"$f":"P19","v":0}]
[null,5,"Less Profession tax paid, Enterteainment Allowance exempted",null,null,null,null,null,null,null,null,null,null,{"$f":"'det.sal input'!W31& \" +\"&'det.sal input'!W35","v":" +"},null,null,null,{"$f":"'det.sal input'!W31+'det.sal input'!W35","v":0}]
[null,6,"Less Standard deduction ( maximum 40000)",null,null,null,null,null,null,null,null,null,null,null,null,null,null,{"$f":"IF((R18-R19-R20)>40000,40000,(R18-R19-R20))","v":0}]
[null,"6a","Net Salary Income [Income chargeble under the head salary]  (3-4-5-6)",null,null,null,null,null,null,null,null,null,null,null,null,null,":",{"$f":"R18-R19-R20-R21","v":0}]
[null,7,"1. Income from house property (interst on Housing loan is a negative income)",null,null,null,null,null,null,null,null,null,null,null,{"$f":"0-MIN(U23:V23)","v":0},null,null,{"$f":"IF(ISNUMBER(#REF!),#REF!,\"Nil\")","v":"Nil"},null,null,200000,{"$f":"INVEST!F17","v":0},{"$f":"V23-U23","v":-200000}]
[null,null,"2.Other sources Income INCLUDING PAY REVISION ARREAR INTEREST [ Interest on investment / Family pension__ (1/3 of family pension or 15000 whichever  is less is exempted) For SB account interest Rs. 10000 is exempted U/S  80TTA . FD interest is fully taxable (senior citizen upto 50000 exempt)",null,null,null,null,null,null,null,null,null,null,null,{"$f":"IF(PERSONAL!H5=\"Below 60 Years\",'tds det'!H13+Z24+'arrear det'!K13,'tds det'!H13+Z24+'arrear det'!K13-'tds det'!M12)","v":0},null,null,{"$f":"\"Pay revision interest \"&'arrear det'!K13","v":"Pay revision interest 0"},{"$f":"\"Investment interest \"&O24-Z24-'det.sal input'!W27","v":"Investment interest 0"},{"$f":"\"Family Pension \"&Z24","v":"Family Pension 0"},"1/3 family pension",{"$f":"ROUND('det.sal input'!W30/3,0)","v":0},15000,{"$f":"MIN(V24:W24)","v":0},"taxable portion of family pen",{"$f":"'det.sal input'!W30-ANTICIPATORY!X24","v":0}]
[null,null,"3. Income from profession",null,null,null,null,null,null,null,null,null,null,null,{"$f":"'tds det'!E6","v":0}]
[null,null,"4.Captal gain income",null,null,null,null,null,null,null,null,null,null,null,{"$f":"'tds det'!E5","v":"`"},null,"Total",{"$f":"SUM(O23:P26)","v":0}]
[null,8,"Gross Total Income (6+7)",null,null,null,null,null,null,null,null,null,null,null,null,null,":",{"$f":"R22+R26","v":0}]
[null,9,"Deduction under chapter VI-A",null,null,null,null,null,null,null,null,null,null,null,"Amount spent",null,null,"Eligible amount"]
[null,null,"A - Deduction under section 80C",null,null,null,null,null,null,null,null,null,null,null,null,null,null,"(See point 9 D)"]
[null,null,"a) ","Providend fund contribution",null,null,null,null,null,null,null,null,null,":",{"$f":"M95","v":0}]
[null,null,"c)","State Life Insurance Policy (SLI)",null,null,null,null,null,null,null,null,null,":",{"$f":"N95","v":0}]
[null,null,"c) ","Group Insurance Scheme (GIS)",null,null,null,null,null,null,null,null,null,":",{"$f":"O95","v":0}]
[null,null,"d) ","Tax saving Fixed deposits (Available at all banks) /Sukanya samrudhi",null,null,null,null,null,null,null,null,null,":",{"$f":"INVEST!F8","v":0}]
[null,null,"e) ","Life Insurence  salary deduction",null,null,null,null,null,null,null,null,null,null,{"$f":"P95","v":0}]
[null,null,"f) ","Life Insurence other than salary deduction ",null,null,null,null,null,null,null,null,null,":",{"$f":"INVEST!F5","v":0}]
[null,null,"g) ",{"$f":"'det.sal input'!R6&\" +  \"&'det.sal input'!T6","v":"? +  ?"},null,null,null,null,null,null,null,null,null,null,{"$f":"R95","v":0}]
[null,null,"h) ","NSC VIII th issue (Nationional Savings certificate from post offices)",null,null,null,null,null,null,null,null,null,":",{"$f":"INVEST!F7","v":0}]
[null,null,"i)","Public Provident Fund (PPF) (Available at Post offfices)",null,null,null,null,null,null,null,null,null,":",{"$f":"INVEST!F9","v":0}]
[null,null,null,"ULIP/ Tax saving mutual funds",null,null,null,null,null,null,null,null,null,null,{"$f":"INVEST!F10","v":0},null,null,null,null,null,"nps allowed amt"]
[null,null,"j)","Tuition Fees ( Paid  for full time education to any two children -only the tuition fee portion-donations should be excluded)",null,null,null,null,null,null,null,null,null,":",{"$f":"INVEST!F11","v":0},null,null,null,null,null,{"$f":"O44","v":0},{"$f":"IF(O44=0,\"\",(O45-O44-150000)*-1)","v":""}]
[null,null,"k)","Housing Loan Repayment (PRINCIPAL PORTION ONLY) for construction loan only. Not for addition / repair loan etc.  Stamp duty paid for purchase of property can be included",null,null,null,null,null,null,null,null,null,":",{"$f":"INVEST!F12","v":0},null,null,null,null,null,"OVER 1.5",{"$f":"IF(O45<=150000,0,(O45)-150000)","v":0},"MAX 80CC-1B=",50000,"TOT NPS=",{"$f":"V46","v":0},"MIN AMT =",{"$f":"MIN(V41,X41,Z41)","v":0}]
[null,null,"l)",{"$f":"INVEST!E13","v":0},null,null,null,null,null,null,null,null,null,null,{"$f":"INVEST!F13","v":0},null,null,null,null,null,"Tot VIA excl nps=",{"$f":"SUM(O30:P43)","v":0},"ALLOED VIA =",150000]
[null,null,"B- Contribution to Pension Fund (80CCC)",null,null,null,null,null,null,null,null,null,null,null,{"$f":"INVEST!F6","v":0}]
[null,null,"C-Contrubution to National Pension Scheme - NPS (80CCD)",null,null,null,null,null,null,null,null,null,null,":",{"$f":"V46","v":0},null,null,{"$f":"MIN(U40:V40)","v":0},null,null,"nps sal ded",{"$f":"'det.sal input'!U26","v":0}]
[null,null,"D- Total investment under  Sec.  80C, 80CCC, 80CCD, eligible amt. limited to 1.5  lakh",null,null,null,null,null,null,null,null,null,null,null,{"$f":"SUM(O30:P44)","v":0},null,null,{"$f":"IF(O45<=150000,O45,150000)","v":0},null,null,"nps direct pay",{"$f":"INVEST!F15","v":0}]
[null,10,"a. ","Contrubution to National Pension Scheme - NPS Section 80CCD(1B) Investment upto 50000 can be made additionally",null,null,null,null,null,null,null,null,null,":",{"$f":"AB41","v":0},null,null,null,null,null,"total NPS",{"$f":"V44+V45","v":0}]
[null,null,"b.","Employer's contribution to NPS [Up to 10% Pay+Da+AGPgets excemption u/s Section 80CCD(2)]",null,null,null,null,null,null,null,null,null,null,{"$f":"IF(X47<V47,X47,V47)","v":0},null,null,null,null,null,"total pay+da+agp 10% =",{"$f":"ROUND(Y47*0.1,0)","v":0},"Empr contri =",{"$f":"'det.sal input'!W32","v":0},{"$f":"'det.sal input'!C26+'det.sal input'!D26+'det.sal input'!F26-'det.sal input'!C20","v":0}]
[null,null,"c.","Investment in Rajiv Gandhi Equity Savings Scheme 80CCG (50% of investment gets exemption.Maximum 25000)",null,null,null,null,null,null,null,null,null,null,{"$f":"INVEST!F16/2","v":0}]
[null,null,"c) ","Mediclaim ( Maximum of Rs.25,000 for self, spouse, children and Rs.25000 for Parents. if Parents are senior citizens Rs. 30,000)(80 D)",null,null,null,null,null,null,null,null,null,":",{"$f":"IF(X49<V49,X49,V49)","v":0},null,null,null,null,null,"max 80 D=",55000,"Actual 80d =",{"$f":"INVEST!F18","v":0}]
[null,null,"d) ","Expenditure on Medical treatment of mentally or physically handicapped dependents (including Specified investments there on). ( Max. Rs.75,000/- in case of severe disability max. Rs.1,25,000) (80DD)",null,null,null,null,null,null,null,null,null,":",{"$f":"IF(X50<V50,X50,V50)","v":0},null,null,null,null,null,"max 80dd=",125000,"Actual 80dd =",{"$f":"INVEST!F21","v":0}]
[null,null,"e) ","For medical treatment of specified diseases of self/dependent . Actual exp. Or Rs. 40000/60000/ 80000 which ever is less gets excemption depending on age. Should submit Form-10-I. (80 DDB)",null,null,null,null,null,null,null,null,null,null,{"$f":"INVEST!F22","v":0}]
[null,null,"f)","Any amount of interest paid for Educational Loan  for higher education of the employee's dependent children [u/s 80E]",null,null,null,null,null,null,null,null,null,":",{"$f":"INVEST!F20","v":0}]
[null,null,"g) ","Additional deduction on housing loan interest (maximum 50000) if the following conditions are satisfied. 1. loan amount is not above Rs. 35 lakhs,  2.  Loan sanctioned in 2016-17,  3. He is a first time home buyer,   4.  cost of house does not exceed Rs. 50 lakhs (80EE)",null,null,null,null,null,null,null,null,null,null,{"$f":"IF(U53<0,0,U53)","v":0},null,null,null,null,null,{"$f":"IF(PERSONAL!H20=\"YES\",ANTICIPATORY!V23-ANTICIPATORY!U23,0)","v":0}]
[null,null,"h) ","SALARY CHALLENGE & Donation to special funds only  PM's National Relief Fund,  Earth quake fund Etc (80G)",null,null,null,null,null,null,null,null,null,":",{"$f":"'new statement'!O55","v":0}]
[null,null,"i)","Dedution for differently abled Employees( 80U)For blindness,Hearing impaired, Mental retradation, Mental illness, low vision, Locomotors disability.  Fixed deduction of 75000 (For disability not less than 40%)  / 1.25 Lakh, for severe disability over 80% ",null,null,null,null,null,null,null,null,null,":",{"$f":"INVEST!F19+'det.sal input'!Z26","v":0}]
[null,null,null,"Total of 10",null,null,null,null,null,null,null,null,null,null,{"$f":"SUM(O46:P55)","v":0}]
[null,11,"Total Deduction   (9+10)",null,null,null,null,null,null,null,null,null,null,null,null,null,null,{"$f":"R45+O56","v":0}]
[null,12,"Total Income or Taxable Income  (rounded off to the nearest multiple of ten (8-11)",null,null,null,null,null,null,null,null,null,null,null,"Before rounding",null,{"$f":"R27-R57","v":0},{"$f":"IF(R27-R57>0,ROUND(((R27-R57)/10),0)*10,0)","v":0}]
[null,13,"Tax on Total Income (Up to 2.5 lakh Nil, between 250001and 5 lakh 5%,  between 500001 and 10 lakh 20%, above 10 lakh 30%, (special rates to senior/ super senior citizens )",null,null,null,null,null,null,null,null,null,null,null,null,null,":",{"$f":"'new form 16'!J81","v":0}]
[null,14,"Less 87 A Rebate, upto a maximum of Rs.2500, available only if Taxable income is less than 350001 (Rebate u/s 87A) Rebate reduced from 5000 to 2500 in the financial year 2017-18",null,null,null,null,null,null,null,null,null,null,null,null,null,null,{"$f":"'new form 16'!K82","v":0}]
[null,15,"Balance of Tax after 87A rebate ",null,null,null,null,null,null,null,null,null,null,null,null,null,null,{"$f":"R59-R60","v":0}]
[null,16,"Education Cess @ 4% of  tax",null,null,null,null,null,null,null,null,null,null,null,null,null,":",{"$f":"'new form 16'!J84","v":0}]
[null,17,"Total Tax Payable (13-14+16)",null,null,null,null,null,null,null,null,null,null,null,null,null,":",{"$f":"'new form 16'!J85","v":0},null,null,{"$f":"R63","v":0}]
[null,18,"Less : Relief for Arrears of Salary u/s 89(1) attach 10 E set of forms and previous years tax statements",null,null,null,null,null,null,null,null,null,null,null,null,null,":",{"$f":"IF('arrear det'!K100>0,'arrear det'!K100,U64)","v":0},null,null,{"$f":"IF(INVEST!F24>R63,R63,'Form 10E'!H40)","v":0}]
[null,19,"Balance Tax Payable (17-18) rounded to 10 rupees.",null,null,null,null,null,null,null,null,{"$f":"\"( before rounding \"&R63-R64&\") \"","v":"( before rounding 0) "},null,null,null,null,":",{"$f":"ROUND('new form 16'!J87,-1)","v":0}]
[null,20,"Amount of Tax already deducted from salary (TDS)",null,null,null,null,null,null,null,null,null,null,null,null,null,":",{"$f":"'det.sal input'!Q26","v":0}]
[null,21,"Amount of Tax deducted from interest on deposits (FD,RD,Time deposit,  if any) (SB interest upto 10000 is not taxable ) Attach document issued by bank ",null,null,null,null,null,null,null,null,null,null,null,null,null,null,{"$f":"'tds det'!G19","v":0},null,null,{"$f":"R65-R67-R68","v":0},{"$f":"ROUND(U67,-1)","v":0}]
[null,22,"Advance tax paid (Directly paid through bank challan) Challan details :",null,null,null,null,null,null,null,null,null,null,{"$f":"'tds det'!D18","v":0},null,null,null,{"$f":"'tds det'!E18","v":0}]
[null,23,"Balance of Tax due in the future months  (19-20-21-22)     Before rounding ",null,null,null,null,null,null,null,null,null,null,{"$f":"R63-R64-R66-R67-R68","v":0},null,null,null,{"$f":"R65-R66-R67-R68","v":0},null,null,{"$f":"ROUND(R69,-1)","v":0}]
[null,24,{"$f":"\"Monthly TDS amount  required in the next  \"&PERSONAL!H22&\" months including this month\"","v":"Monthly TDS amount  required in the next  12 months including this month"},null,null,null,null,null,null,null,null,null,null,null,null,null,null,{"$f":"IF(U69<1,0,U69/PERSONAL!H22)","v":0},null,{"$f":"\"Signature of  \"&F5","v":"Signature of  0"}]
[]
[null,{"$f":"\"True copy, Counter signed by \"&CUSTOMISE!H24&\", \"&CUSTOMISE!H26","v":"True copy, Counter signed by , "},null,null,null,null,null,null,null,null,null,null,null,null,null,null,null,null,null,{"$f":"PERSONAL!H4&\", \"&PERSONAL!H6","v":", "},"10 ലേക്ക് ROUND  ചെയ്ത നികുതി സംഖ്യയാണ് ശരിയായ നികുതി. "]
[null,{"$f":"\"Place: \"&PERSONAL!H11","v":"Place: 0"},null,null,null,null,null,null,null,null,null,null,null,null,"http://babuvadukkumchery.blogspot.in",null,null,null,null,null,"ROUND  ചെയ്യാത്ത തുക ഇവിടെ വെറുതെ  അറിവിലേക്കായി നല്‍കീ എന്നേ കരുതേണ്ടൂ "]
[null,"Date :",null,{"$f":"TEXT(TODAY(),\"dd/mm/yyyy\")","v":"05/02/2024"}]
[null,"DETAILS OF EXPECTED SALARY AND DEDUCTIONS  FOR THE FINANCIAL YEAR 2018-19"]
[null,null,null,{"$f":"IF('det.sal input'!$B$6=\"pension\",\"EXPECTED PENSION RECEIPTS\",\"EXPECTED SALARY RECEIPTS\")","v":"EXPECTED SALARY RECEIPTS"},null,null,null,null,null,null,null,null,"EXPECTED DEDUCTIONS FROM OFFICE"]
[null," For the Month",null,"Pay /Pension","AGP","DA","HRA",{"$f":"UPPER('det.sal input'!H6)","v":"?"},{"$f":"UPPER('det.sal input'!I6)","v":"?"},{"$f":"UPPER('det.sal input'!J6)","v":"?"},{"$f":"UPPER('det.sal input'!K6)","v":"?"},"Total",{"$f":"'det.sal input'!M6","v":"PF"},{"$f":"'det.sal input'!N6","v":"SLI"},{"$f":"'det.sal input'!O6","v":"GI"},"LIC/PLI","TDS",{"$f":"UPPER('det.sal input'!R6&\"+ \"&'det.sal input'!T6)","v":"?+ ?"},{"$f":"'det.sal input'!U6","v":" (NPS)"},{"$f":"'det.sal input'!W6","v":"TOTAL DEDUCTIONS"}]
[null,{"$f":"IF('det.sal input'!$B$6=\"pension\",\"April-18\",\"March-18\")","v":"March-18"},null,{"$f":"'det.sal input'!C8","v":0},{"$f":"'det.sal input'!D8","v":0},{"$f":"'det.sal input'!F8","v":0},{"$f":"'det.sal input'!G8","v":0},{"$f":"'det.sal input'!H8","v":0},{"$f":"'det.sal input'!I8","v":0},{"$f":"'det.sal input'!J8","v":0},{"$f":"'det.sal input'!K8","v":0},{"$f":"'det.sal input'!L8","v":0},{"$f":"'det.sal input'!M8","v":0},{"$f":"'det.sal input'!N8","v":0},{"$f":"'det.sal input'!O8","v":0},{"$f":"'det.sal input'!P8","v":0},{"$f":"'det.sal input'!Q8","v":0},{"$f":"'det.sal input'!R8+'det.sal input'!T8","v":0},{"$f":"'det.sal input'!U8","v":0},{"$f":"'det.sal input'!W8","v":0}]
[null,{"$f":"IF('det.sal input'!$B$6=\"pension\",\"May-17\",\"April\")","v":"April"},null,{"$f":"'det.sal input'!C9","v":0},{"$f":"'det.sal input'!D9","v":0},{"$f":"'det.sal input'!F9","v":0},{"$f":"'det.sal input'!G9","v":0},{"$f":"'det.sal input'!H9","v":0},{"$f":"'det.sal input'!I9","v":0},{"$f":"'det.sal input'!J9","v":0},{"$f":"'det.sal input'!K9","v":0},{"$f":"'det.sal input'!L9","v":0},{"$f":"'det.sal input'!M9","v":0},{"$f":"'det.sal input'!N9","v":0},{"$f":"'det.sal input'!O9","v":0},{"$f":"'det.sal input'!P9","v":0},{"$f":"'det.sal input'!Q9","v":0},{"$f":"'det.sal input'!R9+'det.sal input'!T9","v":0},{"$f":"'det.sal input'!U9","v":0},{"$f":"'det.sal input'!W9","v":0}]
[null,{"$f":"'det.sal input'!B10","v":"May"},null,{"$f":"'det.sal input'!C10","v":0},{"$f":"'det.sal input'!D10","v":0},{"$f":"'det.sal input'!F10","v":0},{"$f":"'det.sal input'!G10","v":0},{"$f":"'det.sal input'!H10","v":0},{"$f":"'det.sal input'!I10","v":0},{"$f":"'det.sal input'!J10","v":0},{"$f":"'det.sal input'!K10","v":0},{"$f":"'det.sal input'!L10","v":0},{"$f":"'det.sal input'!M10","v":0},{"$f":"'det.sal input'!N10","v":0},{"$f":"'det.sal input'!O10","v":0},{"$f":"'det.sal input'!P10","v":0},{"$f":"'det.sal input'!Q10","v":0},{"$f":"'det.sal input'!R10+'det.sal input'!T10","v":0},{"$f":"'det.sal input'!U10","v":0},{"$f":"'det.sal input'!W10","v":0}]
[null,{"$f":"'det.sal input'!B11","v":"June"},null,{"$f":"'det.sal input'!C11","v":0},{"$f":"'det.sal input'!D11","v":0},{"$f":"'det.sal input'!F11","v":0},{"$f":"'det.sal input'!G11","v":0},{"$f":"'det.sal input'!H11","v":0},{"$f":"'det.sal input'!I11","v":0},{"$f":"'det.sal input'!J11","v":0},{"$f":"'det.sal input'!K11","v":0},{"$f":"'det.sal input'!L11","v":0},{"$f":"'det.sal input'!M11","v":0},{"$f":"'det.sal input'!N11","v":0},{"$f":"'det.sal input'!O11","v":0},{"$f":"'det.sal input'!P11","v":0},{"$f":"'det.sal input'!Q11","v":0},{"$f":"'det.sal input'!R11+'det.sal input'!T11","v":0},{"$f":"'det.sal input'!U11","v":0},{"$f":"'det.sal input'!W11","v":0}]
[null,{"$f":"'det.sal input'!B12","v":"July"},null,{"$f":"'det.sal input'!C12","v":0},{"$f":"'det.sal input'!D12","v":0},{"$f":"'det.sal input'!F12","v":0},{"$f":"'det.sal input'!G12","v":0},{"$f":"'det.sal input'!H12","v":0},{"$f":"'det.sal input'!I12","v":0},{"$f":"'det.sal input'!J12","v":0},{"$f":"'det.sal input'!K12","v":0},{"$f":"'det.sal input'!L12","v":0},{"$f":"'det.sal input'!M12","v":0},{"$f":"'det.sal input'!N12","v":0},{"$f":"'det.sal input'!O12","v":0},{"$f":"'det.sal input'!P12","v":0},{"$f":"'det.sal input'!Q12","v":0},{"$f":"'det.sal input'!R12+'det.sal input'!T12","v":0},{"$f":"'det.sal input'!U12","v":0},{"$f":"'det.sal input'!W12","v":0}]
[null,{"$f":"'det.sal input'!B13","v":"August"},null,{"$f":"'det.sal input'!C13","v":0},{"$f":"'det.sal input'!D13","v":0},{"$f":"'det.sal input'!F13","v":0},{"$f":"'det.sal input'!G13","v":0},{"$f":"'det.sal input'!H13","v":0},{"$f":"'det.sal input'!I13","v":0},{"$f":"'det.sal input'!J13","v":0},{"$f":"'det.sal input'!K13","v":0},{"$f":"'det.sal input'!L13","v":0},{"$f":"'det.sal input'!M13","v":0},{"$f":"'det.sal input'!N13","v":0},{"$f":"'det.sal input'!O13","v":0},{"$f":"'det.sal input'!P13","v":0},{"$f":"'det.sal input'!Q13","v":0},{"$f":"'det.sal input'!R13+'det.sal input'!T13","v":0},{"$f":"'det.sal input'!U13","v":0},{"$f":"'det.sal input'!W13","v":0}]
[null,{"$f":"'det.sal input'!B14","v":"September"},null,{"$f":"'det.sal input'!C14","v":0},{"$f":"'det.sal input'!D14","v":0},{"$f":"'det.sal input'!F14","v":0},{"$f":"'det.sal input'!G14","v":0},{"$f":"'det.sal input'!H14","v":0},{"$f":"'det.sal input'!I14","v":0},{"$f":"'det.sal input'!J14","v":0},{"$f":"'det.sal input'!K14","v":0},{"$f":"'det.sal input'!L14","v":0},{"$f":"'det.sal input'!M14","v":0},{"$f":"'det.sal input'!N14","v":0},{"$f":"'det.sal input'!O14","v":0},{"$f":"'det.sal input'!P14","v":0},{"$f":"'det.sal input'!Q14","v":0},{"$f":"'det.sal input'!R14+'det.sal input'!T14","v":0},{"$f":"'det.sal input'!U14","v":0},{"$f":"'det.sal input'!W14","v":0}]
[null,{"$f":"'det.sal input'!B15","v":"October"},null,{"$f":"'det.sal input'!C15","v":0},{"$f":"'det.sal input'!D15","v":0},{"$f":"'det.sal input'!F15","v":0},{"$f":"'det.sal input'!G15","v":0},{"$f":"'det.sal input'!H15","v":0},{"$f":"'det.sal input'!I15","v":0},{"$f":"'det.sal input'!J15","v":0},{"$f":"'det.sal input'!K15","v":0},{"$f":"'det.sal input'!L15","v":0},{"$f":"'det.sal input'!M15","v":0},{"$f":"'det.sal input'!N15","v":0},{"$f":"'det.sal input'!O15","v":0},{"$f":"'det.sal input'!P15","v":0},{"$f":"'det.sal input'!Q15","v":0},{"$f":"'det.sal input'!R15+'det.sal input'!T15","v":0},{"$f":"'det.sal input'!U15","v":0},{"$f":"'det.sal input'!W15","v":0}]
[null,{"$f":"'det.sal input'!B16","v":"November"},null,{"$f":"'det.sal input'!C16","v":0},{"$f":"'det.sal input'!D16","v":0},{"$f":"'det.sal input'!F16","v":0},{"$f":"'det.sal input'!G16","v":0},{"$f":"'det.sal input'!H16","v":0},{"$f":"'det.sal input'!I16","v":0},{"$f":"'det.sal input'!J16","v":0},{"$f":"'det.sal input'!K16","v":0},{"$f":"'det.sal input'!L16","v":0},{"$f":"'det.sal input'!M16","v":0},{"$f":"'det.sal input'!N16","v":0},{"$f":"'det.sal input'!O16","v":0},{"$f":"'det.sal input'!P16","v":0},{"$f":"'det.sal input'!Q16","v":0},{"$f":"'det.sal input'!R16+'det.sal input'!T16","v":0},{"$f":"'det.sal input'!U16","v":0},{"$f":"'det.sal input'!W16","v":0}]
[null,{"$f":"'det.sal input'!B17","v":"December"},null,{"$f":"'det.sal input'!C17","v":0},{"$f":"'det.sal input'!D17","v":0},{"$f":"'det.sal input'!F17","v":0},{"$f":"'det.sal input'!G17","v":0},{"$f":"'det.sal input'!H17","v":0},{"$f":"'det.sal input'!I17","v":0},{"$f":"'det.sal input'!J17","v":0},{"$f":"'det.sal input'!K17","v":0},{"$f":"'det.sal input'!L17","v":0},{"$f":"'det.sal input'!M17","v":0},{"$f":"'det.sal input'!N17","v":0},{"$f":"'det.sal input'!O17","v":0},{"$f":"'det.sal input'!P17","v":0},{"$f":"'det.sal input'!Q17","v":0},{"$f":"'det.sal input'!R17+'det.sal input'!T17","v":0},{"$f":"'det.sal input'!U17","v":0},{"$f":"'det.sal input'!W17","v":0}]
[null,{"$f":"'det.sal input'!B18","v":"Jan- 2024"},null,{"$f":"'det.sal input'!C18","v":0},{"$f":"'det.sal input'!D18","v":0},{"$f":"'det.sal input'!F18","v":0},{"$f":"'det.sal input'!G18","v":0},{"$f":"'det.sal input'!H18","v":0},{"$f":"'det.sal input'!I18","v":0},{"$f":"'det.sal input'!J18","v":0},{"$f":"'det.sal input'!K18","v":0},{"$f":"'det.sal input'!L18","v":0},{"$f":"'det.sal input'!M18","v":0},{"$f":"'det.sal input'!N18","v":0},{"$f":"'det.sal input'!O18","v":0},{"$f":"'det.sal input'!P18","v":0},{"$f":"'det.sal input'!Q18","v":0},{"$f":"'det.sal input'!R18+'det.sal input'!T18","v":0},{"$f":"'det.sal input'!U18","v":0},{"$f":"'det.sal input'!W18","v":0}]
[null,{"$f":"'det.sal input'!B19","v":"Feb-2024"},null,{"$f":"'det.sal input'!C19","v":0},{"$f":"'det.sal input'!D19","v":0},{"$f":"'det.sal input'!F19","v":0},{"$f":"'det.sal input'!G19","v":0},{"$f":"'det.sal input'!H19","v":0},{"$f":"'det.sal input'!I19","v":0},{"$f":"'det.sal input'!J19","v":0},{"$f":"'det.sal input'!K19","v":0},{"$f":"'det.sal input'!L19","v":0},{"$f":"'det.sal input'!M19","v":0},{"$f":"'det.sal input'!N19","v":0},{"$f":"'det.sal input'!O19","v":0},{"$f":"'det.sal input'!P19","v":0},{"$f":"'det.sal input'!Q19+R69","v":0},{"$f":"'det.sal input'!R19+'det.sal input'!T19","v":0},{"$f":"'det.sal input'!U19","v":0},{"$f":"SUM(M89:S89)","v":0}]
[null,"Fest. All",null,{"$f":"'det.sal input'!C20","v":0},null,null,null,null,null,null,null,{"$f":"'det.sal input'!L20","v":0}]
[null,"Arrear","PF",{"$f":"'det.sal input'!C21","v":0},{"$f":"'det.sal input'!D21","v":0},{"$f":"'det.sal input'!F21","v":0},{"$f":"'det.sal input'!G21","v":0},{"$f":"'det.sal input'!H21","v":0},{"$f":"'det.sal input'!I21","v":0},{"$f":"'det.sal input'!J21","v":0},{"$f":"'det.sal input'!K21","v":0},{"$f":"'det.sal input'!L21","v":0},{"$f":"'det.sal input'!M21","v":0},{"$f":"'det.sal input'!N21","v":0},{"$f":"'det.sal input'!O21","v":0},{"$f":"'det.sal input'!P21","v":0},{"$f":"'det.sal input'!Q21","v":0},{"$f":"'det.sal input'!R21+'det.sal input'!T21","v":0},{"$f":"'det.sal input'!U21","v":0},{"$f":"'det.sal input'!W21","v":0}]
[null,null,"CASH/NPS",{"$f":"'det.sal input'!C22","v":0},{"$f":"'det.sal input'!D22","v":0},{"$f":"'det.sal input'!F22","v":0},{"$f":"'det.sal input'!G22","v":0},{"$f":"'det.sal input'!H22","v":0},{"$f":"'det.sal input'!I22","v":0},{"$f":"'det.sal input'!J22","v":0},{"$f":"'det.sal input'!K22","v":0},{"$f":"'det.sal input'!L22","v":0},{"$f":"'det.sal input'!M22","v":0},{"$f":"'det.sal input'!N22","v":0},{"$f":"'det.sal input'!O22","v":0},{"$f":"'det.sal input'!P22","v":0},{"$f":"'det.sal input'!Q22","v":0},{"$f":"'det.sal input'!R22+'det.sal input'!T22","v":0},{"$f":"'det.sal input'!U22","v":0},{"$f":"'det.sal input'!W22","v":0}]
[null,"Leave surrender",null,{"$f":"'det.sal input'!C23","v":0},{"$f":"'det.sal input'!D23","v":0},{"$f":"'det.sal input'!F23","v":0},{"$f":"'det.sal input'!G23","v":0},{"$f":"'det.sal input'!H23","v":0},{"$f":"'det.sal input'!I23","v":0},{"$f":"'det.sal input'!J23","v":0},{"$f":"'det.sal input'!K23","v":0},{"$f":"'det.sal input'!L23","v":0},{"$f":"'det.sal input'!M23","v":0},{"$f":"'det.sal input'!N23","v":0},{"$f":"'det.sal input'!O23","v":0},{"$f":"'det.sal input'!P23","v":0},{"$f":"'det.sal input'!Q23","v":0},{"$f":"'det.sal input'!R23+'det.sal input'!T23","v":0},{"$f":"'det.sal input'!U23","v":0},{"$f":"'det.sal input'!W23","v":0}]
[null,{"$f":"'det.sal input'!B25","v":"Deferred salary received total"},null,{"$f":"'det.sal input'!C24","v":0},{"$f":"'det.sal input'!D24","v":0},{"$f":"'det.sal input'!F24","v":0},{"$f":"'det.sal input'!G24","v":0},{"$f":"'det.sal input'!H24","v":0},{"$f":"'det.sal input'!I24","v":0},{"$f":"'det.sal input'!J24","v":0},{"$f":"'det.sal input'!K24","v":0},{"$f":"'det.sal input'!L24","v":0},{"$f":"'det.sal input'!M24","v":0},{"$f":"'det.sal input'!N24","v":0},{"$f":"'det.sal input'!O24","v":0},{"$f":"'det.sal input'!P24","v":0},{"$f":"'det.sal input'!Q24","v":0},{"$f":"'det.sal input'!R24+'det.sal input'!T24","v":0},{"$f":"'det.sal input'!U24","v":0},{"$f":"'det.sal input'!W24","v":0}]
[null,"Total ",null,{"$f":"'det.sal input'!C26","v":0},{"$f":"'det.sal input'!D26","v":0},{"$f":"'det.sal input'!F26","v":0},{"$f":"'det.sal input'!G26","v":0},{"$f":"'det.sal input'!H26","v":0},{"$f":"'det.sal input'!I26","v":0},{"$f":"'det.sal input'!J26","v":0},{"$f":"'det.sal input'!K26","v":0},{"$f":"'det.sal input'!L26","v":0},{"$f":"'det.sal input'!M26","v":0},{"$f":"'det.sal input'!N26","v":0},{"$f":"'det.sal input'!O26","v":0},{"$f":"'det.sal input'!P26","v":0},{"$f":"SUM(Q78:Q88)","v":0},{"$f":"'det.sal input'!R26+'det.sal input'!T26","v":0},{"$f":"'det.sal input'!U26","v":0},{"$f":"SUM(T78:T94)-Q89","v":0}]
[]
[null,null,null,{"$f":"IF(#REF!<0,\"Refund of salary\",\"Other receipts from office\")","v":{"$error":"#REF!"}},null,null,null,null,null,null,null,null,null,null,null,null,null,{"$f":"ROUND(U68,-1)","v":0}]
[]
[]
[]
[]
[]
[]
[]
[]
[]
[]
[]
[]
[]
[]
[]
[]
[]
[]
[]
[]
[]
[]
[]
[]
[]
[]
[]
[]
[]
[]
[]
[]
[]
[]
[]
[]
[]
[]
[]
[]
[]
[]
[]
[]
[]
[]
[]
[]
[]
[]
[]
[]
[]
[]
[]
[]
[]
[]
[]
[]
[]
[]
[]
[]
[]
[]
[]
[]
[]
[]
[]
[]
[]
[]
[]
[]
[]
[]
[]
[]
[]
[]
[]
[]
[]
[]
[]
[]
[]
[]
[]
[]
[]
[]
[]
[]
[]
[]
[]
[]
[]
[]
[]
[]
[]
[]
[]
[]
[]
[]
[]
[]
[]
[]
[]
[]
[]
[]
[]
[]
[]
[]
[]
[null,null,null,null,null,null,null,null,null,null,null,null,null,null,null,null,null,null,null,null,null,null,null,null,null,null,null,null,"Male",{"$f":"IF(AND(R58>200000,R58<=500000),(R58-200000)*0.1,IF(AND(R58>500000,R58<=1000000),30000+(R58-500000)*0.2,IF(R58>1000000,130000+(R58-1000000)*0.3,\"Nil\")))","v":"Nil"}]
[null,null,null,null,null,null,null,null,null,null,null,null,null,null,null,null,null,null,null,null,null,null,null,null,null,null,null,null,"Female",{"$f":"IF(AND(R58>200000,R58<=500000),(R58-200000)*0.1,IF(AND(R58>500000,R58<=1000000),30000+(R58-500000)*0.2,IF(R58>1000000,130000+(R58-1000000)*0.3,\"Nil\")))","v":"Nil"}]
[null,null,null,null,null,null,null,null,null,null,null,null,null,null,null,null,null,null,null,null,null,null,null,null,null,null,null,null,"Senior",{"$f":"IF(AND(R58>250000,R58<=500000),(R58-250000)*0.1,IF(AND(R58>500000,R58<=1000000),25000+(R58-500000)*0.2,IF(R58>1000000,125000+(R58-1000000)*0.3,\"Nil\")))","v":"Nil"}]
[null,null,null,null,null,null,null,null,null,null,null,null,null,null,null,null,null,null,null,null,null,null,null,null,null,null,null,null,"Senior2",{"$f":"IF(AND(R58>500000,R58<=1000000),(R58-500000)*0.2,IF(R58>1000000,100000+(R58-1000000)*0.3,\"Nil\"))","v":"Nil"}]
[]
[]
[]
[null,null,null,null,null,null,null,null,null,null,null,null,null,null,null,null,null,null,null,null,null,null,null,null,null,null,null,null,{"$f":"IF(O30<>\"Nil\",\"Life Insurance Premum\",\"\")","v":"Life Insurance Premum"},{"$f":"IF(O30<>\"Nil\",O30,\"\")","v":0},{"$f":"IF(ROW()-ROW(two)+1>ROWS(one)-COUNTBLANK(one),\"\",INDIRECT(ADDRESS(SMALL((IF(one<>\"\",ROW(one),ROW()+ROWS(one))),ROW()-ROW(two)+1),COLUMN(one),4)))","v":{"$error":"#REF!"}},{"$f":"IF(AE228<>\"\",VLOOKUP(AE228,AC228:AD241,2,FALSE),\"\")","v":{"$error":"#REF!"}}]
[null,null,null,null,null,null,null,null,null,null,null,null,null,null,null,null,null,null,null,null,null,null,null,null,null,null,null,null,{"$f":"IF(#REF!<>\"Nil\",\"Purchase of NSC\",\"\")","v":{"$error":"#REF!"}},{"$f":"IF(#REF!<>\"Nil\",#REF!,\"\")","v":{"$error":"#REF!"}},{"$f":"IF(ROW()-ROW(two)+1>ROWS(one)-COUNTBLANK(one),\"\",INDIRECT(ADDRESS(SMALL((IF(one<>\"\",ROW(one),ROW()+ROWS(one))),ROW()-ROW(two)+1),COLUMN(one),4)))","v":{"$error":"#REF!"}},{"$f":"IF(AE229<>\"\",VLOOKUP(AE229,AC229:AD244,2,FALSE),\"\")","v":{"$error":"#REF!"}}]
[null,null,null,null,null,null,null,null,null,null,null,null,null,null,null,null,null,null,null,null,null,null,null,null,null,null,null,null,{"$f":"IF(O32<>\"Nil\",\"State Life Insurance (SLI)\",\"\")","v":"State Life Insurance (SLI)"},{"$f":"IF(O32<>\"Nil\",O32,\"\")","v":0},{"$f":"IF(ROW()-ROW(two)+1>ROWS(one)-COUNTBLANK(one),\"\",INDIRECT(ADDRESS(SMALL((IF(one<>\"\",ROW(one),ROW()+ROWS(one))),ROW()-ROW(two)+1),COLUMN(one),4)))","v":{"$error":"#REF!"}},{"$f":"IF(AE230<>\"\",VLOOKUP(AE230,AC230:AD245,2,FALSE),\"\")","v":{"$error":"#REF!"}}]
[null,null,null,null,null,null,null,null,null,null,null,null,null,null,null,null,null,null,null,null,null,null,null,null,null,null,null,null,{"$f":"IF(O33<>\"Nil\",\"Group Insurance Scheme (GIS)\",\"\")","v":"Group Insurance Scheme (GIS)"},{"$f":"IF(O33<>\"Nil\",O33,\"\")","v":0},{"$f":"IF(ROW()-ROW(two)+1>ROWS(one)-COUNTBLANK(one),\"\",INDIRECT(ADDRESS(SMALL((IF(one<>\"\",ROW(one),ROW()+ROWS(one))),ROW()-ROW(two)+1),COLUMN(one),4)))","v":{"$error":"#REF!"}},{"$f":"IF(AE231<>\"\",VLOOKUP(AE231,AC231:AD246,2,FALSE),\"\")","v":{"$error":"#REF!"}}]
[null,null,null,null,null,null,null,null,null,null,null,null,null,null,null,null,null,null,null,null,null,null,null,null,null,null,null,null,{"$f":"IF(#REF!<>\"Nil\",\"Group Personal Accident Insurance (GPAIS)\",\"\")","v":{"$error":"#REF!"}},{"$f":"IF(#REF!<>\"Nil\",#REF!,\"\")","v":{"$error":"#REF!"}},{"$f":"IF(ROW()-ROW(two)+1>ROWS(one)-COUNTBLANK(one),\"\",INDIRECT(ADDRESS(SMALL((IF(one<>\"\",ROW(one),ROW()+ROWS(one))),ROW()-ROW(two)+1),COLUMN(one),4)))","v":{"$error":"#REF!"}},{"$f":"IF(AE232<>\"\",VLOOKUP(AE232,AC232:AD247,2,FALSE),\"\")","v":{"$error":"#REF!"}}]
[null,null,null,null,null,null,null,null,null,null,null,null,null,null,null,null,null,null,null,null,null,null,null,null,null,null,null,null,{"$f":"IF(O34<>\"Nil\",D34,\"\")","v":"Life Insurence  salary deduction"},{"$f":"IF(O34<>\"Nil\",O34,\"\")","v":0},{"$f":"IF(ROW()-ROW(two)+1>ROWS(one)-COUNTBLANK(one),\"\",INDIRECT(ADDRESS(SMALL((IF(one<>\"\",ROW(one),ROW()+ROWS(one))),ROW()-ROW(two)+1),COLUMN(one),4)))","v":{"$error":"#REF!"}},{"$f":"IF(AE233<>\"\",VLOOKUP(AE233,AC233:AD248,2,FALSE),\"\")","v":{"$error":"#REF!"}}]
[null,null,null,null,null,null,null,null,null,null,null,null,null,null,null,null,null,null,null,null,null,null,null,null,null,null,null,null,{"$f":"IF(O35<>\"Nil\",\"Provident Fund\",\"\")","v":"Provident Fund"},{"$f":"IF(O35<>\"Nil\",O35,\"\")","v":0},{"$f":"IF(ROW()-ROW(two)+1>ROWS(one)-COUNTBLANK(one),\"\",INDIRECT(ADDRESS(SMALL((IF(one<>\"\",ROW(one),ROW()+ROWS(one))),ROW()-ROW(two)+1),COLUMN(one),4)))","v":{"$error":"#REF!"}},{"$f":"IF(AE234<>\"\",VLOOKUP(AE234,AC234:AD248,2,FALSE),\"\")","v":{"$error":"#REF!"}}]
[null,null,null,null,null,null,null,null,null,null,null,null,null,null,null,null,null,null,null,null,null,null,null,null,null,null,null,null,{"$f":"IF(O38<>\"Nil\",\"Unit Linked Insurance\",\"\")","v":"Unit Linked Insurance"},{"$f":"IF(O38<>\"Nil\",O38,\"\")","v":0},{"$f":"IF(ROW()-ROW(two)+1>ROWS(one)-COUNTBLANK(one),\"\",INDIRECT(ADDRESS(SMALL((IF(one<>\"\",ROW(one),ROW()+ROWS(one))),ROW()-ROW(two)+1),COLUMN(one),4)))","v":{"$error":"#REF!"}},{"$f":"IF(AE235<>\"\",VLOOKUP(AE235,AC235:AD249,2,FALSE),\"\")","v":{"$error":"#REF!"}}]
[null,null,null,null,null,null,null,null,null,null,null,null,null,null,null,null,null,null,null,null,null,null,null,null,null,null,null,null,{"$f":"IF(#REF!<>\"Nil\",\"Tax Saving Mutual Fund\",\"\")","v":{"$error":"#REF!"}},{"$f":"IF(#REF!<>\"Nil\",#REF!,\"\")","v":{"$error":"#REF!"}},{"$f":"IF(ROW()-ROW(two)+1>ROWS(one)-COUNTBLANK(one),\"\",INDIRECT(ADDRESS(SMALL((IF(one<>\"\",ROW(one),ROW()+ROWS(one))),ROW()-ROW(two)+1),COLUMN(one),4)))","v":{"$error":"#REF!"}},{"$f":"IF(AE236<>\"\",VLOOKUP(AE236,AC236:AD250,2,FALSE),\"\")","v":{"$error":"#REF!"}}]
[null,null,null,null,null,null,null,null,null,null,null,null,null,null,null,null,null,null,null,null,null,null,null,null,null,null,null,null,{"$f":"IF(O40<>\"Nil\",\"Tuition Fees\",\"\")","v":"Tuition Fees"},{"$f":"IF(O40<>\"Nil\",O40,\"\")","v":0},{"$f":"IF(ROW()-ROW(two)+1>ROWS(one)-COUNTBLANK(one),\"\",INDIRECT(ADDRESS(SMALL((IF(one<>\"\",ROW(one),ROW()+ROWS(one))),ROW()-ROW(two)+1),COLUMN(one),4)))","v":{"$error":"#REF!"}},{"$f":"IF(AE237<>\"\",VLOOKUP(AE237,AC236:AD251,2,FALSE),\"\")","v":{"$error":"#REF!"}}]
[null,null,null,null,null,null,null,null,null,null,null,null,null,null,null,null,null,null,null,null,null,null,null,null,null,null,null,null,{"$f":"IF(O41<>\"Nil\",\"Housing Loan Repayment\",\"\")","v":"Housing Loan Repayment"},{"$f":"IF(O41<>\"Nil\",O41,\"\")","v":0},{"$f":"IF(ROW()-ROW(two)+1>ROWS(one)-COUNTBLANK(one),\"\",INDIRECT(ADDRESS(SMALL((IF(one<>\"\",ROW(one),ROW()+ROWS(one))),ROW()-ROW(two)+1),COLUMN(one),4)))","v":{"$error":"#REF!"}},{"$f":"IF(AE238<>\"\",VLOOKUP(AE238,AC237:AD251,2,FALSE),\"\")","v":{"$error":"#REF!"}}]
[null,null,null,null,null,null,null,null,null,null,null,null,null,null,null,null,null,null,null,null,null,null,null,null,null,null,null,null,{"$f":"IF(#REF!<>\"Nil\",\"Eligibleshares & debentures\",\"\")","v":{"$error":"#REF!"}},{"$f":"IF(#REF!<>\"Nil\",#REF!,\"\")","v":{"$error":"#REF!"}},{"$f":"IF(ROW()-ROW(two)+1>ROWS(one)-COUNTBLANK(one),\"\",INDIRECT(ADDRESS(SMALL((IF(one<>\"\",ROW(one),ROW()+ROWS(one))),ROW()-ROW(two)+1),COLUMN(one),4)))","v":{"$error":"#REF!"}},{"$f":"IF(AE239<>\"\",VLOOKUP(AE239,AC237:AD251,2,FALSE),\"\")","v":{"$error":"#REF!"}}]
[null,null,null,null,null,null,null,null,null,null,null,null,null,null,null,null,null,null,null,null,null,null,null,null,null,null,null,null,{"$f":"IF(#REF!<>\"Nil\",\"Mutual Fund\",\"\")","v":{"$error":"#REF!"}},{"$f":"IF(#REF!<>\"Nil\",#REF!,\"\")","v":{"$error":"#REF!"}},{"$f":"IF(ROW()-ROW(two)+1>ROWS(one)-COUNTBLANK(one),\"\",INDIRECT(ADDRESS(SMALL((IF(one<>\"\",ROW(one),ROW()+ROWS(one))),ROW()-ROW(two)+1),COLUMN(one),4)))","v":{"$error":"#REF!"}},{"$f":"IF(AE240<>\"\",VLOOKUP(AE240,AC238:AD251,2,FALSE),\"\")","v":{"$error":"#REF!"}}]
[null,null,null,null,null,null,null,null,null,null,null,null,null,null,null,null,null,null,null,null,null,null,null,null,null,null,null,null,{"$f":"IF(#REF!<>\"Nil\",#REF!,\"\")","v":{"$error":"#REF!"}},{"$f":"IF(#REF!<>\"Nil\",#REF!,\"\")","v":{"$error":"#REF!"}},{"$f":"IF(ROW()-ROW(two)+1>ROWS(one)-COUNTBLANK(one),\"\",INDIRECT(ADDRESS(SMALL((IF(one<>\"\",ROW(one),ROW()+ROWS(one))),ROW()-ROW(two)+1),COLUMN(one),4)))","v":{"$error":"#REF!"}},{"$f":"IF(AE241<>\"\",VLOOKUP(AE241,AC239:AD251,2,FALSE),\"\")","v":{"$error":"#REF!"}}]
[null,null,null,null,null,null,null,null,null,null,null,null,null,null,null,null,null,null,null,null,null,null,null,null,null,null,null,null,null,null,{"$f":"IF(ROW()-ROW(two)+1>ROWS(one)-COUNTBLANK(one),\"\",INDIRECT(ADDRESS(SMALL((IF(one<>\"\",ROW(one),ROW()+ROWS(one))),ROW()-ROW(two)+1),COLUMN(one),4)))","v":""},{"$f":"IF(AE242<>\"\",VLOOKUP(AE242,AC240:AD251,2,FALSE),\"\")","v":""}]
[null,null,null,null,null,null,null,null,null,null,null,null,null,null,null,null,null,null,null,null,null,null,null,null,null,null,null,null,null,null,{"$f":"IF(ROW()-ROW(two)+1>ROWS(one)-COUNTBLANK(one),\"\",INDIRECT(ADDRESS(SMALL((IF(one<>\"\",ROW(one),ROW()+ROWS(one))),ROW()-ROW(two)+1),COLUMN(one),4)))","v":""},{"$f":"IF(AE243<>\"\",VLOOKUP(AE243,AC241:AD252,2,FALSE),\"\")","v":""}]
[]
[]
[null,null,null,null,null,null,null,null,null,null,null,null,null,null,null,null,null,null,null,null,null,null,null,null,null,null,null,null,{"$f":"IF(ANTICIPATORY!O49<>\"Nil\",\"Mediclaim Policies (Sec 80D)\",\"\")","v":"Mediclaim Policies (Sec 80D)"},{"$f":"IF(AC246<>\"\",O49,\"\")","v":0},{"$f":"IF(ROW()-ROW(four)+1>ROWS(three)-COUNTBLANK(three),\"\",INDIRECT(ADDRESS(SMALL((IF(three<>\"\",ROW(three),ROW()+ROWS(three))),ROW()-ROW(four)+1),COLUMN(three),4)))","v":{"$error":"#REF!"}},{"$f":"IF(ROW()-ROW(fouramt)+1>ROWS(threeamt)-COUNTBLANK(threeamt),\"\",INDIRECT(ADDRESS(SMALL((IF(threeamt<>\"\",ROW(threeamt),ROW()+ROWS(threeamt))),ROW()-ROW(fouramt)+1),COLUMN(threeamt),4)))","v":{"$error":"#REF!"}}]
[null,null,null,null,null,null,null,null,null,null,null,null,null,null,null,null,null,null,null,null,null,null,null,null,null,null,null,null,{"$f":"IF(ANTICIPATORY!O50<>\"Nil\",\"Medical Treatment Mentally or Physically handicapped (Sec-80DD)\",\"\")","v":"Medical Treatment Mentally or Physically handicapped (Sec-80DD)"},{"$f":"IF(AC247<>\"\",O50,\"\")","v":0},{"$f":"IF(ROW()-ROW(four)+1>ROWS(three)-COUNTBLANK(three),\"\",INDIRECT(ADDRESS(SMALL((IF(three<>\"\",ROW(three),ROW()+ROWS(three))),ROW()-ROW(four)+1),COLUMN(three),4)))","v":{"$error":"#REF!"}},{"$f":"IF(ROW()-ROW(fouramt)+1>ROWS(threeamt)-COUNTBLANK(threeamt),\"\",INDIRECT(ADDRESS(SMALL((IF(threeamt<>\"\",ROW(threeamt),ROW()+ROWS(threeamt))),ROW()-ROW(fouramt)+1),COLUMN(threeamt),4)))","v":{"$error":"#REF!"}}]
[null,null,null,null,null,null,null,null,null,null,null,null,null,null,null,null,null,null,null,null,null,null,null,null,null,null,null,null,{"$f":"IF(ANTICIPATORY!#REF!<>\"Nil\",\"Expenditure on Medical Treatment(Sec-80DDB)\",\"\")","v":{"$error":"#REF!"}},{"$f":"IF(AC248<>\"\",#REF!,\"\")","v":{"$error":"#REF!"}},{"$f":"IF(ROW()-ROW(four)+1>ROWS(three)-COUNTBLANK(three),\"\",INDIRECT(ADDRESS(SMALL((IF(three<>\"\",ROW(three),ROW()+ROWS(three))),ROW()-ROW(four)+1),COLUMN(three),4)))","v":{"$error":"#REF!"}},{"$f":"IF(ROW()-ROW(fouramt)+1>ROWS(threeamt)-COUNTBLANK(threeamt),\"\",INDIRECT(ADDRESS(SMALL((IF(threeamt<>\"\",ROW(threeamt),ROW()+ROWS(threeamt))),ROW()-ROW(fouramt)+1),COLUMN(threeamt),4)))","v":{"$error":"#REF!"}}]
[null,null,null,null,null,null,null,null,null,null,null,null,null,null,null,null,null,null,null,null,null,null,null,null,null,null,null,null,{"$f":"IF(ANTICIPATORY!O52<>\"Nil\",\"Interest on Educational Loan (Sec-80 E)\",\"\")","v":"Interest on Educational Loan (Sec-80 E)"},{"$f":"IF(AC249<>\"\",O52,\"\")","v":0},{"$f":"IF(ROW()-ROW(four)+1>ROWS(three)-COUNTBLANK(three),\"\",INDIRECT(ADDRESS(SMALL((IF(three<>\"\",ROW(three),ROW()+ROWS(three))),ROW()-ROW(four)+1),COLUMN(three),4)))","v":{"$error":"#REF!"}},{"$f":"IF(ROW()-ROW(fouramt)+1>ROWS(threeamt)-COUNTBLANK(threeamt),\"\",INDIRECT(ADDRESS(SMALL((IF(threeamt<>\"\",ROW(threeamt),ROW()+ROWS(threeamt))),ROW()-ROW(fouramt)+1),COLUMN(threeamt),4)))","v":{"$error":"#REF!"}}]
[null,null,null,null,null,null,null,null,null,null,null,null,null,null,null,null,null,null,null,null,null,null,null,null,null,null,null,null,{"$f":"IF(ANTICIPATORY!O54<>\"Nil\",\"Donation to Charitable Institutions (Sec-80 G)\",\"\")","v":"Donation to Charitable Institutions (Sec-80 G)"},{"$f":"IF(AC250<>\"\",O54,\"\")","v":0},{"$f":"IF(ROW()-ROW(four)+1>ROWS(three)-COUNTBLANK(three),\"\",INDIRECT(ADDRESS(SMALL((IF(three<>\"\",ROW(three),ROW()+ROWS(three))),ROW()-ROW(four)+1),COLUMN(three),4)))","v":{"$error":"#REF!"}},{"$f":"IF(ROW()-ROW(fouramt)+1>ROWS(threeamt)-COUNTBLANK(threeamt),\"\",INDIRECT(ADDRESS(SMALL((IF(threeamt<>\"\",ROW(threeamt),ROW()+ROWS(threeamt))),ROW()-ROW(fouramt)+1),COLUMN(threeamt),4)))","v":{"$error":"#REF!"}}]
[null,null,null,null,null,null,null,null,null,null,null,null,null,null,null,null,null,null,null,null,null,null,null,null,null,null,null,null,{"$f":"IF(ANTICIPATORY!#REF!<>\"Nil\",\"Contribution to Political Parties (Sec-80 GGC)\",\"\")","v":{"$error":"#REF!"}},{"$f":"IF(AC251<>\"\",#REF!,\"\")","v":{"$error":"#REF!"}},{"$f":"IF(ROW()-ROW(four)+1>ROWS(three)-COUNTBLANK(three),\"\",INDIRECT(ADDRESS(SMALL((IF(three<>\"\",ROW(three),ROW()+ROWS(three))),ROW()-ROW(four)+1),COLUMN(three),4)))","v":{"$error":"#REF!"}},{"$f":"IF(ROW()-ROW(fouramt)+1>ROWS(threeamt)-COUNTBLANK(threeamt),\"\",INDIRECT(ADDRESS(SMALL((IF(threeamt<>\"\",ROW(threeamt),ROW()+ROWS(threeamt))),ROW()-ROW(fouramt)+1),COLUMN(threeamt),4)))","v":{"$error":"#REF!"}}]
[null,null,null,null,null,null,null,null,null,null,null,null,null,null,null,null,null,null,null,null,null,null,null,null,null,null,null,null,{"$f":"IF(ANTICIPATORY!O55<>\"Nil\",\"Deduction for Handicapped Employees (u/s 80U)\",\"\")","v":"Deduction for Handicapped Employees (u/s 80U)"},{"$f":"IF(AC252<>\"\",O55,\"\")","v":0},{"$f":"IF(ROW()-ROW(four)+1>ROWS(three)-COUNTBLANK(three),\"\",INDIRECT(ADDRESS(SMALL((IF(three<>\"\",ROW(three),ROW()+ROWS(three))),ROW()-ROW(four)+1),COLUMN(three),4)))","v":{"$error":"#REF!"}},{"$f":"IF(ROW()-ROW(fouramt)+1>ROWS(threeamt)-COUNTBLANK(threeamt),\"\",INDIRECT(ADDRESS(SMALL((IF(threeamt<>\"\",ROW(threeamt),ROW()+ROWS(threeamt))),ROW()-ROW(fouramt)+1),COLUMN(threeamt),4)))","v":{"$error":"#REF!"}}]
[]
[null,null,null,null,null,null,null,null,null,null,null,null,null,null,null,null,null,null,null,null,null,null,null,null,null,null,null,null,{"$f":"IF(ISNUMBER(#REF!),\"Income From House Property\",\"\")","v":""},{"$f":"IF(AC254<>\"\",#REF!,\"\")","v":""},{"$f":"IF(ROW()-ROW(six)+1>ROWS(five)-COUNTBLANK(five),\"\",INDIRECT(ADDRESS(SMALL((IF(five<>\"\",ROW(five),ROW()+ROWS(five))),ROW()-ROW(six)+1),COLUMN(five),4)))","v":{"$error":"#REF!"}},{"$f":"IF(ROW()-ROW(sixamt)+1>ROWS(fiveamt)-COUNTBLANK(fiveamt),\"\",INDIRECT(ADDRESS(SMALL((IF(fiveamt<>\"\",ROW(fiveamt),ROW()+ROWS(fiveamt))),ROW()-ROW(sixamt)+1),COLUMN(fiveamt),4)))","v":{"$error":"#REF!"}}]
[null,null,null,null,null,null,null,null,null,null,null,null,null,null,null,null,null,null,null,null,null,null,null,null,null,null,null,null,{"$f":"IF(#REF!>0,#REF!,\"\")","v":{"$error":"#REF!"}},{"$f":"IF(AC255<>\"\",#REF!,\"\")","v":{"$error":"#REF!"}},{"$f":"IF(ROW()-ROW(six)+1>ROWS(five)-COUNTBLANK(five),\"\",INDIRECT(ADDRESS(SMALL((IF(five<>\"\",ROW(five),ROW()+ROWS(five))),ROW()-ROW(six)+1),COLUMN(five),4)))","v":{"$error":"#REF!"}},{"$f":"IF(ROW()-ROW(sixamt)+1>ROWS(fiveamt)-COUNTBLANK(fiveamt),\"\",INDIRECT(ADDRESS(SMALL((IF(fiveamt<>\"\",ROW(fiveamt),ROW()+ROWS(fiveamt))),ROW()-ROW(sixamt)+1),COLUMN(fiveamt),4)))","v":{"$error":"#REF!"}}]
[null,null,null,null,null,null,null,null,null,null,null,null,null,null,null,null,null,null,null,null,null,null,null,null,null,null,null,null,{"$f":"IF(#REF!>0,#REF!,\"\")","v":{"$error":"#REF!"}},{"$f":"IF(AC256<>\"\",#REF!,\"\")","v":{"$error":"#REF!"}},{"$f":"IF(ROW()-ROW(six)+1>ROWS(five)-COUNTBLANK(five),\"\",INDIRECT(ADDRESS(SMALL((IF(five<>\"\",ROW(five),ROW()+ROWS(five))),ROW()-ROW(six)+1),COLUMN(five),4)))","v":{"$error":"#REF!"}},{"$f":"IF(ROW()-ROW(sixamt)+1>ROWS(fiveamt)-COUNTBLANK(fiveamt),\"\",INDIRECT(ADDRESS(SMALL((IF(fiveamt<>\"\",ROW(fiveamt),ROW()+ROWS(fiveamt))),ROW()-ROW(sixamt)+1),COLUMN(fiveamt),4)))","v":{"$error":"#REF!"}}]
[null,null,null,null,null,null,null,null,null,null,null,null,null,null,null,null,null,null,null,null,null,null,null,null,null,null,null,null,{"$f":"IF(#REF!>0,#REF!,\"\")","v":{"$error":"#REF!"}},{"$f":"IF(AC257<>\"\",#REF!,\"\")","v":{"$error":"#REF!"}},{"$f":"IF(ROW()-ROW(six)+1>ROWS(five)-COUNTBLANK(five),\"\",INDIRECT(ADDRESS(SMALL((IF(five<>\"\",ROW(five),ROW()+ROWS(five))),ROW()-ROW(six)+1),COLUMN(five),4)))","v":""},{"$f":"IF(ROW()-ROW(sixamt)+1>ROWS(fiveamt)-COUNTBLANK(fiveamt),\"\",INDIRECT(ADDRESS(SMALL((IF(fiveamt<>\"\",ROW(fiveamt),ROW()+ROWS(fiveamt))),ROW()-ROW(sixamt)+1),COLUMN(fiveamt),4)))","v":""}]
[]
[]
[null,null,null,null,null,null,null,null,null,null,null,null,null,null,null,null,null,null,null,null,null,null,null,null,null,null,null,null,{"$f":"IF(AND(R65<>\"Nil\",R66<>\"Nil\"),R65-R66,IF(AND(R65>0,R66=\"Nil\"),R65,IF(AND(R66>0,R65=\"Nil\"),(0-R66),\"Nil\")))","v":0}]

{"sheet":"help","index":4,"n_rows":114,"n_cols":11,"rows_kept":114,"cut":false,"hidden":false,"merged":[[109,2,109,13],[4,10,4,15],[6,10,6,15],[8,15,32,15],[35,10,35,17],[106,2,106,13],[113,5,113,9],[1,1,1,13],[37,2,37,13],[40,2,40,13],[64,2,64,13],[103,2,103,13],[107,2,107,13],[8,8,33,8],[67,2,67,13],[69,2,69,13],[102,2,102,13],[4,2,4,7],[6,2,6,7]]}
[]
[null,"In order to functions this programme properly, the following 10 initial steps are required. For that note the points in a paper and follow  directions. ചുവടെ കാണുന്ന ലളിതമായ 10 നടപടികള്‍ ഒരിക്കല്‍ മാത്രം പൂര്‍ത്തീകരിച്ചാല്‍ മാത്രമേ ഈ പ്രോഗ്രാം പ്രവര്‍ത്തിക്കൂ. ഈ വരികള്‍ സ്ക്രീനില്‍ വായിക്കുന്നതോടൊപ്പം അത് ചെയ്യുക പ്രായോഗികമല്ല അതിനാല്‍ ഒരു കടലാസില്‍ കുറിച്ചെടുത്തു  കടലാസ് പരിശോധിച്ച് ചെയ്യുകയാണ്   വേണ്ടത് "]
[]
[]
[null,"MS Office - 2007 or higher versions","For Excel 2007  versions എക്സല്‍ 2007 പതിപ്പിന് ",null,null,null,null,null,null,null,"For Excel 2010 versions എക്സല്‍ 2010 പതിപ്പിന് "]
[]
[null,1,"Click the button (office button) on left top corner of screen (എക്സല്‍ 2007 പതിപ്പില്‍ ഇടതു മുകള്‍ ഭാഗത്ത് കാണുന്ന ബട്ടന്‍ ക്ലിക്ക് )",null,null,null,null,null,null,1,"Click the green FILE button on left top corner of  screen  (എക്സല്‍ 2010 പതിപ്പില്‍ ഇടതു മുകള്‍ ഭാഗത്ത് കാണുന്ന പച്ച FILE ബട്ടന്‍ ക്ലിക്ക് )"]
[]
[null,null,null,null,null,null,null,null,"ഇത് മാതൃകാ ചിത്രമാണ് ക്ലിക്ക് ചെയ്യേണ്ടത് ഇവിടെയല്ല "]
[]
[]
[]
[]
[]
[]
[]
[]
[]
[]
[]
[]
[]
[]
[]
[]
[]
[]
[]
[]
[]
[]
[]
[]
[]
[]
[null,null,null,null,null,null,null,null,null,2,"Click options button (തുടര്‍ന്ന് ചുവടെ കാണുന്ന options button ക്ലിക്ക് ചെയ്യുക )"]
[]
[null,2,"Click  'Excel Options' button (ചുവടെ കാണുന്ന Excel Options ബട്ടന്‍ ക്ലിക്ക്)"]
[]
[]
[null,3,"Click on  'Trust Centre' in the next view (അടുത്ത ദൃശ്യത്തില്‍ കാണുന്ന Trust Centre ബട്ടണില്‍ ക്ലിക്ക് )"]
[]
[]
[]
[]
[]
[]
[]
[]
[]
[]
[]
[]
[]
[]
[]
[]
[]
[]
[]
[]
[]
[]
[]
[null,4,"Click   'Trust Centre Settings' in the same view (അതെ ദൃശ്യത്തില്‍ കാണുന്ന Trust Centre Settings ല്‍ ക്ലിക്ക് "]
[]
[]
[null,5,"Click on  'Macro Settings' in the next view (അടുത്ത ദൃശ്യത്തില്‍ കാണുന്ന Macro Settings ല്‍ ക്ലിക്ക് )"]
[]
[null,6,"Then Tick the 4th option- Eanbale all macros not reco…(നാലാം ഓപ്ഷന്‍ ആയ Eanbale all macros not reco.. ക്ലിക്ക് ചെയ്യുക )"]
[]
[]
[]
[]
[]
[]
[]
[]
[]
[]
[]
[]
[]
[]
[]
[]
[]
[]
[]
[]
[]
[]
[]
[]
[]
[]
[]
[]
[]
[]
[]
[]
[null,7,"Then Click 'OK' Button in the same field (അതെ ദൃശ്യത്തില്‍ ചുവടെ കാണുന്ന OK ബട്ടണില്‍ ക്ലിക്ക് )"]
[null,8,"Click OK button again in next view ( വീണ്ടും OK ബട്ടന്‍ കാണുന്ന പക്ഷം അതും ക്ലിക്ക് )"]
[]
[]
[null,9,"Then close the flle NEVER SAVE, and reopen the file (തുടര്‍ന്ന് ഫയല്‍ ക്ലോസ് ചെയ്യുക.  സേവ് ചെയ്യണോ എന്ന ചോദ്യത്തിന് NO എന്ന് നല്‍കുക) "]
[null,null,"അതായത് ഒരിക്കലും മേല്‍ പറഞ്ഞ നടപടികള്‍ക്ക് ശേഷം ഫയല്‍ സേവ് ചെയ്യരുത്, പക്ഷെ നിര്‍ബന്ധമായും ക്ലോസ് ചെയ്യണം  എന്നര്‍ത്ഥം "]
[]
[null,10,"Reopen the CLOSED  file, Now the start button will function ( അതെ ഫയല്‍ വീണ്ടും തുറക്കുക, ഇപ്പോള്‍ അത് പ്രവര്ത്തനക്ഷമ മായിരിക്കും )"]
[]
[]
[]
[null,"For assistance Mob : 9947009559",null,null,null,"T download video help file click on these lines"]

{"sheet":"det.sal input","index":5,"n_rows":64,"n_cols":32,"rows_kept":64,"cut":false,"hidden":false,"merged":[[5,21,6,21],[26,13,26,20],[23,18,24,18],[5,7,6,7],[5,13,6,13],[5,18,6,18],[5,2,6,2],[5,16,6,16],[5,14,6,14],[5,11,6,11],[5,12,6,12],[23,27,23,28],[5,9,6,9],[23,16,24,16],[47,1,47,22],[23,3,24,3],[23,22,24,22],[35,17,35,22],[37,1,37,16],[23,15,24,15],[23,19,24,19],[38,1,38,16],[23,17,24,17],[23,20,24,20],[35,1,36,16],[6,4,6,5],[28,1,28,20],[0,28,0,34],[26,24,26,27],[24,26,24,28],[5,22,6,22],[5,8,6,8],[23,14,24,14],[23,12,24,12],[23,13,24,13],[5,10,6,10],[0,25,4,27],[5,25,5,27],[4,12,4,22],[5,20,6,20],[5,19,6,19],[5,17,6,17],[5,15,6,15]]}
[null,"Page 3",null,null,null,null,null,null,null,null,null,null,null,null,null,null,null,null,null,null,null,null,"SCROLL  MOUSE TO SEE  NEXT BUTTON",null,null,"CONTINUE BUTTON കാണാന്‍ mouse സ്ക്രോള്‍ ചെയ്യുക "]
[null,"പൊതുവേ ഉണ്ടാകുന്ന സംശയങ്ങള്‍ ക്രമനമ്പര്‍ 28 നു താഴെ, ഏറ്റവും ചുവടെയുള്ള കുറിപ്പ് വായിച്ച് പരിഹരിക്കാം ",null,null,null,null,null,null,null,null,null,null,null,null,null,null,null,null,null,null,null,null,null,null,null,null,null,null,null,"PENSION"]
[null,"എല്ലാ വിധ Arrear   തുകകളും ക്രമനമ്പര്‍ 14,15 എന്നിവക്ക് നേരെ മാത്രം നല്‍കുക, സാധാരണ മാസ വേതനത്തോടൊപ്പം ചേര്‍ക്കരുത്. Type Deferred salary in 17 A column only  ",null,null,null,null,null,null,null,null,null,null,null,null,null,null,null,null,null,null,null,null,null,null,null,null,null,null,null,"SALARY"]
[null,{"$f":"\" SALARY DETAILS AND OFFICE DEDUCTIONS  FOR 2023-24 OF  \"&   PERSONAL!H4","v":" SALARY DETAILS AND OFFICE DEDUCTIONS  FOR 2023-24 OF  "}]
[null," SALARY /  PENSION  DETAILS ( received/ expected  during 1-4-2023 to 31-3-2024)",null,null,null,null,null,null,null,null,null,null,"DEDUCTIONS FROM SALARY(80C, 80CCD,80G ),  TDS & Medisep"]
[null,{"$f":"PERSONAL!H10","v":"SALARY"},"BASIC PAY /  GROSS PENSION",null,"DA%","DA","HRA","?","?","?","?","TOTAL","PF","SLI","GI","LIC-PLI SALARY DEDUCTION ONLY","Income tax TDS","?","Donation - Office deduction only 80 G","?"," (NPS)","MEDISEP (S-80 D)","TOTAL DEDUCTIONS"]
["Serial   No",{"$f":"IF(B6=\"SALARY\",\"Are you Pensioner ? Go back and edit personal details \",\"If you are not a Pensioner,  Go back and edit personal details\")","v":"Are you Pensioner ? Go back and edit personal details "},null,"AGP"]
[1,{"$f":"IF($B$6=\"salary\",\"For the month March 2023, received in April\",\"April- 2023\")","v":"For the month March 2023, received in April"},null,null,{"$f":"IF($B$6=\"PENSION\",0,'DA ALTER'!E7)","v":7.0000000000000007E-2},{"$f":"IF($B$6=\"pension\",0,'DA ALTER'!F7)","v":0},{"$f":"IF('det.sal input'!C8=0,0,IF('DA ALTER'!I7=0,'DA ALTER'!H7,'DA ALTER'!I7))","v":0},null,null,null,null,{"$f":"C8+D8+F8+G8+H8+I8+J8+K8","v":0},null,null,null,null,null,null,null,null,null,null,{"$f":"SUM(M8:V8)","v":0}]
[2,{"$f":"IF($B$6=\"salary\",\"April 2023\",\"May \")","v":"April 2023"},{"$f":"C8","v":0},{"$f":"D8","v":0},{"$f":"IF($B$6=\"PENSION\",0,'DA ALTER'!E8)","v":7.0000000000000007E-2},{"$f":"IF($B$6=\"pension\",0,'DA ALTER'!F8)","v":0},{"$f":"IF('det.sal input'!C9=0,0,IF('DA ALTER'!I8=0,'DA ALTER'!H8,'DA ALTER'!I8))","v":0},{"$f":"H8","v":0},{"$f":"I8","v":0},{"$f":"J8","v":0},{"$f":"K8","v":0},0,{"$f":"M8","v":0},{"$f":"N8","v":0},{"$f":"O8","v":0},{"$f":"P8","v":0},{"$f":"Q8","v":0},{"$f":"R8","v":0},{"$f":"S8","v":0},{"$f":"T8","v":0},{"$f":"U8","v":0},{"$f":"V8","v":0},0]
[3,{"$f":"IF($B$6=\"salary\",\"May\",\"June \")","v":"May"},0,0,{"$f":"IF($B$6=\"PENSION\",0,'DA ALTER'!E9)","v":7.0000000000000007E-2},{"$f":"IF($B$6=\"pension\",0,'DA ALTER'!F9)","v":0},{"$f":"IF('det.sal input'!C10=0,0,IF('DA ALTER'!I9=0,'DA ALTER'!H9,'DA ALTER'!I9))","v":0},0,0,0,0,0,0,0,0,0,0,0,0,0,0,0,0]
[4,{"$f":"IF($B$6=\"salary\",\"June\",\"July \")","v":"June"},0,0,{"$f":"IF($B$6=\"PENSION\",0,'DA ALTER'!E10)","v":7.0000000000000007E-2},{"$f":"IF($B$6=\"pension\",0,'DA ALTER'!F10)","v":0},{"$f":"IF('det.sal input'!C11=0,0,IF('DA ALTER'!I10=0,'DA ALTER'!H10,'DA ALTER'!I10))","v":0},0,0,0,0,0,0,0,0,0,0,0,0,0,0,0,0]
[5,{"$f":"IF($B$6=\"salary\",\"July\",\"August \")","v":"July"},0,0,{"$f":"IF($B$6=\"PENSION\",0,'DA ALTER'!E11)","v":7.0000000000000007E-2},{"$f":"IF($B$6=\"pension\",0,'DA ALTER'!F11)","v":0},{"$f":"IF('det.sal input'!C12=0,0,IF('DA ALTER'!I11=0,'DA ALTER'!H11,'DA ALTER'!I11))","v":0},0,0,0,0,0,0,0,0,0,0,0,0,0,0,0,0]
[6,{"$f":"IF($B$6=\"salary\",\"August\",\"September\")","v":"August"},0,0,{"$f":"IF($B$6=\"PENSION\",0,'DA ALTER'!E12)","v":7.0000000000000007E-2},{"$f":"IF($B$6=\"pension\",0,'DA ALTER'!F12)","v":0},{"$f":"IF('det.sal input'!C13=0,0,IF('DA ALTER'!I12=0,'DA ALTER'!H12,'DA ALTER'!I12))","v":0},0,0,0,0,0,0,0,0,0,0,0,0,0,0,0,0]
[7,{"$f":"IF($B$6=\"salary\",\"September\",\"October \")","v":"September"},0,0,{"$f":"IF($B$6=\"PENSION\",0,'DA ALTER'!E13)","v":7.0000000000000007E-2},{"$f":"IF($B$6=\"pension\",0,'DA ALTER'!F13)","v":0},{"$f":"IF('det.sal input'!C14=0,0,IF('DA ALTER'!I13=0,'DA ALTER'!H13,'DA ALTER'!I13))","v":0},0,0,0,0,0,0,0,0,0,0,0,0,0,0,0,0]
[8,{"$f":"IF($B$6=\"salary\",\"October\",\"November\")","v":"October"},0,0,{"$f":"IF($B$6=\"PENSION\",0,'DA ALTER'!E14)","v":7.0000000000000007E-2},{"$f":"IF($B$6=\"pension\",0,'DA ALTER'!F14)","v":0},{"$f":"IF('det.sal input'!C15=0,0,IF('DA ALTER'!I14=0,'DA ALTER'!H14,'DA ALTER'!I14))","v":0},0,0,0,0,0,0,0,0,0,0,0,0,0,0,0,0]
[9,{"$f":"IF($B$6=\"salary\",\"November\",\"December\")","v":"November"},0,0,{"$f":"IF($B$6=\"PENSION\",0,'DA ALTER'!E15)","v":7.0000000000000007E-2},{"$f":"IF($B$6=\"pension\",0,'DA ALTER'!F15)","v":0},{"$f":"IF('det.sal input'!C16=0,0,IF('DA ALTER'!I15=0,'DA ALTER'!H15,'DA ALTER'!I15))","v":0},0,0,0,0,0,0,0,0,0,0,0,0,0,0,0,0]
[10,{"$f":"IF($B$6=\"salary\",\"December\",\"Jan-2024\")","v":"December"},0,0,{"$f":"IF($B$6=\"PENSION\",0,'DA ALTER'!E16)","v":7.0000000000000007E-2},{"$f":"IF($B$6=\"pension\",0,'DA ALTER'!F16)","v":0},{"$f":"IF('det.sal input'!C17=0,0,IF('DA ALTER'!I16=0,'DA ALTER'!H16,'DA ALTER'!I16))","v":0},0,0,0,0,0,0,0,0,0,0,0,0,0,0,0,0]
[11,{"$f":"IF($B$6=\"salary\",\"Jan- 2024\",\"Feb-2024\")","v":"Jan- 2024"},0,0,{"$f":"IF($B$6=\"PENSION\",0,'DA ALTER'!E17)","v":7.0000000000000007E-2},{"$f":"IF($B$6=\"pension\",0,'DA ALTER'!F17)","v":0},{"$f":"IF('det.sal input'!C18=0,0,IF('DA ALTER'!I17=0,'DA ALTER'!H17,'DA ALTER'!I17))","v":0},0,0,0,0,0,0,0,0,0,0,0,0,0,0,0,0]
[12,{"$f":"IF($B$6=\"salary\",\"Feb-2024\",\"March 2024\")","v":"Feb-2024"},0,0,{"$f":"IF($B$6=\"PENSION\",0,'DA ALTER'!E18)","v":7.0000000000000007E-2},{"$f":"IF($B$6=\"pension\",0,'DA ALTER'!F18)","v":0},{"$f":"IF('det.sal input'!C19=0,0,IF('DA ALTER'!I18=0,'DA ALTER'!H18,'DA ALTER'!I18))","v":0},0,0,0,0,0,0,0,0,0,null,0,0,0,0,0,0]
[13,"Festival Allowance/ Bonus",null,null,null,null,null,null,null,null,null,{"$f":"C20+D20+F20+G20+H20+I20+J20+K20","v":0}]
[14,"ARREARS CREDITED TO PF. INCLUDING INTEREST (arrear include Leave salary/Salary Arrear/ DA arrear/ Pay revision arrear) ",null,null,null,null,null,null,null,null,null,{"$f":"C21+D21+F21+G21+H21+I21+J21+K21","v":0},{"$f":"C21-N21-O21-P21-Q21-R21-T21-U21","v":0},null,null,null,null,null,null,null,null,null,{"$f":"SUM(M21:U21)","v":0}]
[15,"ARREARS RECEIVED IN CASH [INCLUDING INTEREST] or CREDITED TO NPS (arrear include Leave salary/Salary Arrear/ DA arrear/ Pay revision arrear, surrender arrear etc)",null,null,null,null,null,null,null,null,null,{"$f":"C22+D22+F22+G22+H22+I22+J22+K22","v":0},null,null,null,null,null,null,null,null,null,null,{"$f":"SUM(M22:U22)","v":0}]
[16,"LEAVE SURRENDER (Total of all surrenders, excluding arrears of surrender)",null,null,null,null,null,null,null,null,null,{"$f":"C23+D23+F23+G23+H23+I23+J23+K23","v":0},null,null,null,null,null,null,null,null,null,null,{"$f":"SUM(M23:U23)","v":0}]
[17,"Any other RECEIPTS or REFUNDS from office.  Show refund as Negative figure",null,null,null,null,null,null,null,null,null,{"$f":"C24+D24+F24+G24+H24+I24+J24+K24","v":0},null,null,null,null,null,null,null,null,null,null,{"$f":"SUM(M24:U24)","v":0}]
["17 A","Deferred salary received total",null,null,null,null,null,null,null,null,null,{"$f":"C25","v":0}]
[18,"TOTAL",{"$f":"SUM(C8:C25)","v":0},{"$f":"SUM(D8:D25)","v":0},null,{"$f":"SUM(F8:F25)","v":0},0,0,0,0,0,0,0,0,0,0,0,0,0,0,0,{"$f":"SUM(V8:V25)","v":0},0]
["18 a","normal total excluding additions",{"$f":"C26-SUM(C20:C23)","v":0},{"$f":"D26-SUM(D21:D23)","v":0},null,{"$f":"F26-SUM(F21:F23)","v":0},{"$f":"G26-SUM(G21:G23)","v":0},null,null,null,null,{"$f":"SUM(L21:L22)","v":0},"cash arrer+pf arrear + leave surrender+ other receipt",{"$f":"\"മുകളില്‍ 14, 15 നമ്പറുകളില്‍ ഉള്‍പ്പെട്ടിട്ടുള്ള  \"&C21+C22&\"  arrear  തുകയില്‍ പലിശ ഉണ്ടെങ്കില്‍, രണ്ടിലെയും പലിശ കൂട്ടി   ഇവിടെ കാണിക്കുക  \"","v":"മുകളില്‍ 14, 15 നമ്പറുകളില്‍ ഉള്‍പ്പെട്ടിട്ടുള്ള  0  arrear  തുകയില്‍ പലിശ ഉണ്ടെങ്കില്‍, രണ്ടിലെയും പലിശ കൂട്ടി   ഇവിടെ കാണിക്കുക  "}]
[19,"MEDICAL REIMBURSEMENT received (related with treatment of Self or other members of  family) [Show full amount of receipt]"]
[20,{"$f":"IF(W28>15000,\"Specify the type of hospital where the treatment for the above case was made select from options (ഏതു തരത്തിലുള്ള ആശുപത്രിയിലായിരുന്നു  ചികിത്സ ? ഓപ്ഷനില്‍നിന്നും തെരഞെടുക്കണം) \",\"Skip this field- ഇവിടെ പൂരിപ്പിക്കേണ്ടതില്ല\")","v":"Skip this field- ഇവിടെ പൂരിപ്പിക്കേണ്ടതില്ല"},null,null,null,null,null,null,null,null,null,null,null,null,null,null,null,null,null,null,null,null,null,null,null,null,null,"PRIVATE HOSPITAL",null,null,null,{"$f":"IF(W29=\"PRIVATE HOSPITAL\",2,1)","v":1}]
[20,"Annual Family Pension recived ( if you are the legal heir of deceased employee. Show full amount)",null,null,null,null,null,null,null,null,null,null,null,null,null,null,null,null,null,null,null,null,null,null,null,null,null,"GOVT / LOCAL BODY "]
[21,"Profession Tax Paid (Total ) paid  during the year"]
[22,{"$f":"IF(U26>0,\"EMPLOYER'S  total annual contribution to NPS (PRAN) Section 80CCD(2) [NPS ലേക്കുള്ള Employer  ടെ മൊത്തം വാര്‍ഷിക വിഹിതം]\",\"Skip this field -ഇവിടെ പൂരിപ്പിക്കെണ്ടതില്ല \")","v":"Skip this field -ഇവിടെ പൂരിപ്പിക്കെണ്ടതില്ല "}]
[23,"Annual Value of other Perquistes"]
[24,"Annual Profits in  lieu of salary under section 17(3)"]
[25,"Annual Entertainment Allowance exempted portion (If any)"]
[null,{"$f":"IF(L21+L22+L23=0,\"You can skip the field below ചുവടെയുള്ള ഭാഗം താങ്കള്‍ക്ക് ബാധകമല്ല\",IF(PERSONAL!H8=\"NO\",\" You can skip the field below ചുവടെയുള്ള ഭാഗം താങ്കള്‍ക്ക് ബാധകമല്ല\",\"SINCE YOU ARE LIVING IN A RENTEL HOME, PLEASE FILL THE  FOLLOWING  DETAILS  താങ്കള്‍  വാടക വീട്ടില്‍ താമസിക്കുന്നതിന്റെ ആനുകൂല്യങ്ങള്‍ നേടാനായി  ചുവടെ വിവരങ്ങള്‍ ആവശ്യപ്പെടുന്നുണ്ടെങ്കില്‍ പൂരിപ്പിക്കുക \"))","v":"You can skip the field below ചുവടെയുള്ള ഭാഗം താങ്കള്‍ക്ക് ബാധകമല്ല"},null,null,null,null,null,null,null,null,null,null,null,null,null,null,null,{"$f":"IF(L21+L22+L23=0,\"SKIP THIS FIELD\",IF(PERSONAL!H8=\"NO\",\"SKIP THIS FIELD\",\" FY PERIOD-2023-24\"))","v":"SKIP THIS FIELD"}]
[null,null,null,null,null,null,null,null,null,null,null,null,null,null,null,null,null,"Basic pay",null,"DA","HRA",null,"AGP"]
[26,{"$f":"IF(L27=0,\"\",IF(AB38<AC39,\"You are not required to fill anything here (താങ്കള്‍ ഇവിടെ ഒന്നും ചെയ്യേണ്ടാതായിട്ടില്ല)\",IF(PERSONAL!H8=\"NO\",\"\",\"താങ്കള്‍ വാങ്ങിയ കുടിശ്ശികയില്‍ (Arrear received as cash+ Arrear credited in PF)   2023-24 സാമ്പത്തീക വര്‍ഷത്തേക്ക് ബാധകമായ തുകയുണ്ടെങ്കില്‍ ആ തുകയുടെ മാത്രം  SPLIT UP കണ്ടു  വലതു വശത്ത്‌ കാണിക്കുക, അല്ലാത്ത പക്ഷം ഒന്നും എഴുതേണ്ടതില്ല . \")))","v":""},null,null,null,null,null,null,null,null,null,null,null,null,null,null,null,null,null,null,null,null,null,null,null,null,"rent  ",{"$f":"PERSONAL!H44","v":0},"sal 1/10"]
[27,{"$f":"IF(L23=0,\"\",IF(AB38<AC39,\"You are not required to fill anything here (താങ്കള്‍ ഇവിടെ ഒന്നും ചെയ്യേണ്ടാതായിട്ടില്ല)\",IF(PERSONAL!H8=\"NO\",\"\",\"താങ്കള്‍ വാങ്ങിയ സറണ്ടറില്‍   2023-24 സാമ്പത്തീക വര്‍ഷത്തേക്ക് ബാധകമായ തുകയുണ്ടെങ്കില്‍ അതുമാത്രം   SPLIT UP ആക്കി  വശത്ത്‌ കാണിക്കുക, അല്ലാത്ത പക്ഷം ഒന്നും എഴുതേണ്ടതില്ല . \")))","v":""},null,null,null,null,null,null,null,null,null,null,null,null,null,null,null,null,null,null,null,null,null,null,null,null,"pa+da+agp",{"$f":"C27+D27+F27+SUM(R38:T39)+W38+W39-C25","v":0},{"$f":"AB39*0.1","v":0}]
[null,null,null,null,null,null,null,null,null,null,null,null,null,null,null,null,"TOTAL",{"$f":"R38+R39","v":0},null,{"$f":"T38+T39","v":0},{"$f":"U38+U39","v":0},null,{"$f":"W38+W39","v":0},null,null,null,"HRA acrual",{"$f":"G27+U40","v":0}]
[null,null,null,null,null,null,null,null,null,null,null,null,null,null,null,null,null,null,null,null,null,null,"  ആദ്യ മാസത്തിലെ ശമ്പളമായി കാണിക്കേണ്ടത് 2023 April- 1നോ അതിനു ശേഷമോ കിട്ടിയ"]
[null,null,null,null,null,null,null,null,null,null,null,null,null,null,null,null,null,null,null,null,null,null," ശമ്പളത്തിന്‍റെ തുകയാണ്, പൊതുവേ അത് 2023- March ല്‍ ചെയ്ത ജോലിയുടേതായിരിക്കും"]
[null,null,null,null,null,null,null,null,null,null,null,null,null,null,null,null,null,null,null,null,null,null,"DA,HRA എന്നിവക്ക് പുറമേ നേടിയ അലവന്‍സുകളില്‍ ചിലതിനു നികുതി ഇളവ് ഉണ്ടായേക്കാം. എങ്കിലും അത് ഇവിടെ മറ്റു അലവന്‍സുകള്‍"]
[null,null,null,null,null,null,null,null,null,null,null,null,null,null,null,null,null,null,null,null,null,null,"ചേര്‍ക്കേണ്ടിടത്ത്(ചോദ്യചിഹ്നമിട്ട 4 തലക്കെട്ടിനു കീഴെ)  ഉള്‍പ്പെടുത്തെണ്ടാതാണ്. നാലില്‍ കൂടുതല്‍ അലവന്‍സ് ഉണ്ടെങ്കില്‍, "]
[null,null,null,null,null,null,null,null,null,null,null,null,null,null,null,null,null,null,null,null,null,null,"രണ്ടു അലവന്‍സുകള്‍ കൂട്ടി ഒരു തലക്കെട്ടിനു കീഴെ നല്‍കുക.  അതിനു ലഭ്യമായ ഇളവുകള്‍ കാണിക്കേണ്ടത് അടുത്ത പേജിലാണ്  "]
[null,null,null,null,null,null,null,null,null,null,null,null,null,null,null,null,null,null,null,null,null,null," (DA% തിരുത്തണമെങ്കില്‍ DA തലക്കെട്ടിനു സമീപമുള്ള മഞ്ഞ ബട്ടണില്‍ ക്ലിക്ക് ചെയ്തു തിരുത്തല്‍ വരുത്തുക) "]
[null,null,null,null,null,null,null,null,null,null,null,null,null,null,null,null,null,null,null,null,null,null,"You can edit DA percentage by clicking the  yellow  button near  DA heading"]
[null,"If you are in need of more allowance columns, you cannot create it, but just total all allowances with tax exemption and put the value in first  blank field with heading like Unif Allow+TA, Then total all other allowances without tax exemption and put the value in next blank field with heading like CCA+SP allow. For any doubt dial 9947009559 "]
[null,null,null,null,null,null,null,null,null,null,null,null,null,null,null,null,null,null,null,null,null,null,"GPAIS  അടവ് ഏതെങ്കിലും Deduction column ല്‍ തലക്കെട്ട്‌ നല്‍കി ഉള്‍പ്പെടുത്തുക.  ചുവടെ അനാവശ്യമായി വരുന്ന തുക ഡിലീറ്റ് ചെയ്യുക"]
[]
[]
[null,null,null,null,null,null,null,null,null,null,null,null,null,null,null,null,null,null,null,null,null,null,"അഡ്വാന്‍സ് സാലറിയിലെക്കുള്ള തിരിച്ചടവ് ഉള്ളവര്‍ അടവ് മാസങ്ങളില്‍ ശമ്പളം കുറച്ച് കാണിക്കരുത്"]
[null,null,null,null,null,null,null,null,null,null,null,null,null,null,null,null,null,null,null,null,null,null,"തിരിച്ചടവ് ഇല്ലായിരുന്നെങ്കില്‍ കിട്ടുമായിരുന്ന ശമ്പളമാണ് കാണിക്കേണ്ടത്"]
[null,null,null,null,null,null,null,null,null,null,null,null,null,null,null,null,null,null,null,null,null,null,"PF ലേക്കുള്ള ലോണിന്റെ തിരിച്ചടവ് deduction  കോളത്തില്‍ എഴുതാന്‍ പാടില്ല"]
[null,null,null,null,null,null,null,null,null,null,null,null,null,null,null,null,null,null,null,null,null,null,"ലോണ്‍ തിരിച്ചടവ് ഇല്ലാത്ത സാഹചര്യത്തില്‍ എഴുതുന്ന നിക്ഷേപ സംഖ്യ മാത്രമേ എഴുതാവൂ"]
[null,null,null,null,null,null,null,null,null,null,null,null,null,null,null,null,null,null,null,null,null,null,"PF ലോണ്‍ ഈ സാമ്പത്തീക വര്‍ഷത്തില്‍ വാങ്ങിയാല്‍ അത് വരുമാനമായി ഒരിടത്തും കാണിക്കരുത്"]
[null,null,null,null,null,null,null,null,null,null,null,null,null,null,null,null,null,null,null,null,null,null,"ലോണ്‍ എടുക്കാത്ത വ്യക്തിയാണെന്ന രീതിയില്‍ വിവരങ്ങള്‍ നല്‍കുക"]
[null,null,null,null,null,null,null,null,null,null,null,null,null,null,null,null,null,null,null,null,null,null,"Income from Profession (Eg. Doctors private Practice Income) should be shown in next page"]
[null,null,null,null,null,null,null,null,null,null,null,null,null,null,null,null,null,null,null,null,null,null,"പെന്‍ഷന്‍ ജീവനക്കാര്‍ അത് ബേസിക് പേ കോളത്തില്‍ നല്‍കുക. തെറ്റായി കാണുന്ന DA തുക ഒഴിവാക്കാന്‍ DA തലക്കെട്ടിനു കീഴെ കാണുന്ന മഞ്ഞ"]
[null,null,null,null,null,null,null,null,null,null,null,null,null,null,null,null,null,null,null,null,null,null,"എഡിറ്റ്‌ ബട്ടണില്‍ ക്ലിക്ക് ചെയ്ത് പുതിയ മേഖലയിലെത്തി പരിഷ്കരിക്കാം / ഡിലീറ്റ് ചെയ്യാം"]
[null,null,null,null,null,null,null,null,null,null,null,null,null,null,null,null,null,null,null,null,null,null,"Loss of Pay  ഉണ്ടെങ്കില്‍ 17 നമ്പറിനു നേരെ നെഗറ്റീവ് തുകയായി നല്‍കുക "]
[]
[null,null,null,null,null,null,null,null,null,null,null,null,null,null,null,null,null,null,null,null,null,null,"മിലിട്ടറിയിലോ മറ്റോ മുന്‍പ് ജോലി ചെയ്തു ഇപ്പോള്‍ പെന്‍ഷന്‍ വാങ്ങുന്നവര്‍, ആ പെന്‍ഷന്‍  ഒരു വര്‍ഷത്തെ മുഴുവന്‍ കൂട്ടി അതു 17 ആം റോയില്‍ നല്‍കുക  "]
[null,null,null,null,null,null,null,null,null,null,null,null,null,null,null,null,null,null,null,null,null,null,"അതോടൊപ്പം ഇപ്പോള്‍ മറ്റു ജോലി ചെയ്തു ശമ്പളം വാങ്ങുന്നുണ്ടെങ്കില്‍ അത് അതതു മാസങ്ങളില്‍ സാധാരണ ശമ്പളമായി കാണിക്കുക  "]

{"sheet":"taxplanning","index":6,"n_rows":321,"n_cols":22,"rows_kept":321,"cut":false,"hidden":false,"merged":[[289,14,289,15],[290,14,291,15],[290,16,291,16],[9,12,10,12],[10,2,10,9],[275,2,275,8],[277,2,277,5],[277,6,277,8],[279,6,279,8],[18,10,20,12],[17,2,17,9],[18,2,20,9],[26,2,26,8],[25,2,25,12],[279,2,279,5],[278,6,278,8],[276,2,276,8],[276,14,276,18],[26,17,26,24],[27,2,27,7],[27,17,27,23],[27,9,27,10],[26,9,26,12],[278,2,278,5],[2,1,2,10],[5,2,5,4],[12,2,12,8],[15,2,15,9],[14,2,14,9],[4,2,4,6],[3,2,3,12],[9,10,9,11],[9,2,9,9],[13,2,13,9],[28,2,28,7],[28,17,28,23],[29,2,29,7],[29,17,29,23],[28,9,28,10],[29,9,29,10],[282,2,282,5],[277,14,277,15],[283,6,283,8],[283,2,283,5],[30,9,30,10],[30,2,30,7],[281,2,281,5],[280,6,280,8],[281,6,281,8],[282,6,282,8],[30,17,30,23],[285,6,285,8],[280,2,280,5],[287,2,287,3],[287,6,287,8],[301,2,301,8],[282,10,282,12],[286,6,286,8],[286,2,286,5],[285,2,285,5],[288,6,288,8],[289,6,289,8],[300,2,300,12],[284,6,284,8],[284,2,284,5],[404,14,404,20],[375,13,378,13],[375,20,378,20],[380,13,383,13],[380,20,383,20],[400,20,403,20],[385,20,388,20],[355,13,357,20],[406,13,410,13],[406,20,409,20],[410,14,410,20],[390,13,393,13],[390,20,393,20],[395,13,398,13],[395,20,398,20],[400,13,404,13],[385,13,388,13],[365,13,368,13],[365,20,368,20],[370,13,373,13],[370,20,373,20],[360,13,363,13],[360,20,363,20],[290,18,291,18],[299,14,299,15],[318,9,318,14],[319,9,319,14],[317,9,317,14],[316,9,316,14],[315,9,315,14],[320,2,320,15],[314,2,314,15],[302,8,302,10],[303,8,303,10],[304,8,304,10],[305,8,305,10],[316,2,316,7],[317,2,317,7],[305,2,305,7],[318,2,318,7],[319,2,319,7],[315,2,315,8],[303,2,303,7],[304,2,304,7],[302,2,302,7],[306,2,306,12],[301,9,301,10]]}
[]
[]
[]
[null,null,"HOW TO REDUCE YOUR TAX (നികുതി കുറക്കാന്‍ മാര്‍ഗങ്ങള്‍)",null,null,null,null,null,null,null,null,null,null,null,null,"80 c working","sorted"]
[null,null,{"$f":"\"Dear  \"&PERSONAL!H4&\" ,\"","v":"Dear   ,"},null,null,null,null,null,null,null,null,null,"GO BACK",null,"1L-80c",{"$f":"150000-Q8","v":150000}]
[null,null,null,null,null,null,null,null,null,{"$f":"IF(#REF!<0,0,#REF!)","v":{"$error":"#REF!"}},null,null,null,"ECTAX","ten multi",{"$f":"K7/103*1000","v":0}]
[null,null,"ഫെബ്രുവരി മാസത്തിലെ ശമ്പളത്തില്‍നിന്നും പിടിക്കേണ്ട നികുതി തുക ",null,null,null,null,null,null,null,{"$f":"print!$N$3","v":0},null,"ആണ് ",{"$f":"IF(K7<0,\"(Minus figures shows over payment)\",\"\")","v":""}]
[null,null,"Amount to be deducted from February month's salary is shown above. Minus figure shows over payment of tax ",null,null,null,null,null,null,null,null,null,null,null,null,"80c invest ORIGINAL",{"$f":"'new statement'!R45","v":0}]
[null,null,null,null,null,null,null,null,null,null,null,null,null,null,"medi clame"]
[null,null,"Where you should invest (നികുതിഭാരം കുറക്കാന്‍ നിക്ഷേപിക്കേണ്ട മേഖല)",null,null,null,null,null,null,null,"Amount of Investment needed നികുതി കുറക്കാന്‍ നിക്ഷേപിക്കേണ്ട തുക ഏതാണ്ട് ",null,"If invested, estimated decrease in TAX amount നിക്ഷേപിച്ചാല്‍ നികുതിയില്‍ വരുന്ന കുറവ് ഏതാണ്ട് (Apllicable for 10% Tax slab persons)",null,"maxi",15000]
[null,null,{"$f":"IF('new form 16'!N76>0,\"You are included in 20% tax slab group. Please see instructions below in red colour താങ്കള്‍ 20% നികുതിയുള്ള വിഭാഗത്തില്‍ പെടുന്നതിനാല്‍ ഏറ്റവും ചുവടെയുള്ള ചുവന്ന അക്ഷരങ്ങളില്‍ കാണുന്ന നിര്‍ദ്ദേശങ്ങളാണ് ബാധകം\",\"\")","v":""},null,null,null,null,null,null,null,"10% Tax slab persons ","20% Tax slab persons",null,null,"ten multi",{"$f":"P6","v":0}]
[]
[null,null,"LIC,PLI NSC, PF, PPF, Tax saving FD, Tax saving Mutual fund etc.",null,null,null,null,null,null,"or",{"$f":"IF(K7=0,0,IF(Q8>=150000,0,IF(P5<=P6,P5,IF(P5>P6,P6))))","v":0},null,{"$f":"ROUND(K13*0.103,0)","v":0},null,"80d","ORIGINAL D",{"$f":"INVEST!F18","v":0}]
[null,null,"Mediclaim Policy എടുക്കല്‍ (New India Assurence, United India Assurence, Oriental Insurence എന്നിവിടങ്ങളില്‍ ലഭ്യം . ഇത് നിക്ഷേപമല്ല, മുടക്കിയ പണം തിരികെ ലഭിക്കില്ല ",null,null,null,null,null,null,null,{"$f":"IF(K7=0,0,IF(Q13>=20000,0,IF(P11<P10,P11,IF(Q13<P10,P10-Q13))))","v":0},null,{"$f":"ROUND(K14*0.103,0)","v":0}]
[null,null,{"$f":"IF(K14+INVEST!F18=15000,\"An additional amount up to 15000 / 20000 can be spent for parent's medical policy\",\"\")","v":""}]
[null,null,null,null,null,null,null,null,null,null,null,null,null,null,null,"80ccf working"]
[]
[null,null,"Rajiv Gandhi Equity Savings Scheme (RGESS) ല്‍ പെടുന്ന ഷെയറില്‍(നിക്ഷേപത്തിന്റെ 50% വരുമാനാത്തില്‍ കുറവായി കാണിക്കാം.  50000 രൂപ വരെ നിക്ഷേപിക്കാം. നിക്ഷേപമെന്ന നിലയില്‍ 1.5 ലക്ഷമെന്ന പരിധിക്കുമേല്‍ നടത്താവുന്ന ഒരേ ഒരു നിഷേപപദ്ധതി, ഷെയര്‍ വിപണന കേന്ദ്രങ്ങളില്‍ ലഭിക്കും. ആനുകൂല്യം ലഭിക്കാനായി നിബന്ധനകള്‍ പാലിക്കേണ്ടതുണ്ട് ",null,null,null,null,null,null,null,{"$f":"IF(Q21<=0,0,IF(Q19>=Q22,Q22,Q19))","v":0},null,{"$f":"ROUND(K18*0.103,0)/2","v":0},null,"INVEST ",null,{"$f":"INVEST!#REF!","v":{"$error":"#REF!"}}]
[null,null,"സാലറി അരിയര്‍ വാങ്ങിയിട്ടുണ്ടെങ്കില്‍ S 89 പ്രകാരം ഇളവിന് അര്‍ഹതയുണ്ടോ എന്ന് പിന്‍ പേജിലെ ഒന്നാം മെനുവില്‍ പരിശോധിക്കുക ",null,null,null,null,null,null,null,{"$f":"IF('det.sal input'!#REF!+'det.sal input'!#REF!=0,\"Not applicable\",\"Pl. check your arrear\")","v":{"$error":"#REF!"}},null,null,null,"DOUBLE OF TAX",null,{"$f":"P6*2","v":0}]
[null,null,null,null,null,null,null,null,null,null,null,null,null,null,"INVEST MAX",null,50000]
[null,null,null,null,null,null,null,null,null,null,null,null,null,null,"TAX",null,{"$f":"K7","v":0}]
[null,null,{"$f":"IF('new form 16'!N76>0,\"Your taxable income is more than 5 lakh, therefor the investment need to reduce tax will be less than that shown above\",\"\")","v":""},null,null,null,null,null,null,null,null,null,null,null,"balance possible",null,{"$f":"Q20-Q18","v":{"$error":"#REF!"}}]
[]
[]
[]
[]
[]
[]
[]
[]
[]
[]
[]
[]
[]
[]
[]
[]
[]
[]
[]
[]
[]
[]
[]
[]
[]
[]
[]
[]
[]
[]
[]
[]
[]
[]
[]
[]
[]
[]
[]
[]
[]
[]
[]
[]
[]
[]
[]
[]
[]
[]
[]
[]
[]
[]
[]
[]
[]
[]
[]
[]
[]
[]
[]
[]
[]
[]
[]
[]
[]
[]
[]
[]
[]
[]
[]
[]
[]
[]
[]
[]
[]
[]
[]
[]
[]
[]
[]
[]
[]
[]
[]
[]
[]
[]
[]
[]
[]
[]
[]
[]
[]
[]
[]
[]
[]
[]
[]
[]
[]
[]
[]
[]
[]
[]
[]
[]
[]
[]
[]
[]
[]
[]
[]
[]
[]
[]
[]
[]
[]
[]
[]
[]
[]
[]
[]
[]
[]
[]
[]
[]
[]
[]
[]
[]
[]
[]
[]
[]
[]
[]
[]
[]
[]
[]
[]
[]
[]
[]
[]
[]
[]
[]
[]
[]
[]
[]
[]
[]
[]
[]
[]
[]
[]
[]
[]
[]
[]
[]
[]
[]
[]
[]
[]
[]
[]
[]
[]
[]
[]
[]
[]
[]
[]
[]
[]
[]
[]
[]
[]
[]
[]
[]
[]
[]
[]
[]
[]
[]
[]
[]
[]
[]
[]
[]
[]
[]
[]
[]
[]
[]
[]
[]
[]
[]
[]
[]
[]
[]
[]
[]
[]
[]
[]
[]
[]
[]
[]
[]
[]
[]
[]
[]
[]
[]
[]
[]
[]
[]
[]
[]
[]
[]
[]
[null,null,"താങ്കളുടെ നികുതി എങ്ങിനെയാണ് കണക്കാക്കിയതെന്ന്‍ അറിയുക "]
[null,null,"HOW YOUR TAX IS CALCULATED …? (OLD REGIME Option 1 )",null,null,null,null,null,null,null,"TAX FOR THE FIRST 2.5 LAKH TAXABLE INCOME",null,null,null,"HOW YOUR TAX IS CALCULATED (NEW REGIME Option 2)"]
[null,null,"NAME ",null,null,null,{"$f":"PERSONAL!H4","v":0},null,null,null,"TAX FOR THE FIRST 3 LAKH OF TAXABLE INCOME",null,null,null,"NAME",null,"Not applicable to you",null,"Applicable to you"]
[null,null,"AGE GROUP",null,null,null,{"$f":"PERSONAL!H5","v":"Below 60 Years"},null,null,null,"TAX FOR THE FIRST 5 LAKH OF TAXABLE INCOME",null,null,null,{"$f":"C279","v":"AGE GROUP"},null,"Tx calculation before Marginal relief (see notes link below)","Remaining amount","Tax calculation after considering 115BAC(1A) amendment"]
[null,null,"TAXABLE INCOME (after standard deduction 50000)",null,null,null,{"$f":"'new statement'!R59","v":0},null,null,null,"ABOVE 2.5  LAKH UP TO 5 LAKH 5%",null,null,null,{"$f":"C280","v":"TAXABLE INCOME (after standard deduction 50000)"},null,{"$f":"'new statement (2)'!R59","v":0},null,{"$f":"Q280","v":0}]
[1,null,{"$f":"IF(G279=\"BELOW 60 YEARS\",K277,IF(G279=\"60 TO 79 YEARS\",K278,K279))","v":"TAX FOR THE FIRST 2.5 LAKH TAXABLE INCOME"},null,null,null,0,null,null,null,"ABOVE 3 LAKH UP TO 5 LAKH 5%",null,null,null,"For the first 3 Lakh Taxable income",null,"Rs.0",{"$f":"IF(Q280>300000,(Q280-300000),0)","v":0},{"$f":"Q281","v":"Rs.0"}]
[2,null,{"$f":"IF(G279=\"BELOW 60 YEARS\",K280,IF(G279=\"60 TO 79 YEARS\",K281,\"\"))","v":"ABOVE 2.5  LAKH UP TO 5 LAKH 5%"},null,null,null,{"$f":"IF(G279=M282,'new form 16'!N75,IF(taxplanning!G279=taxplanning!M284,'new form 16'!S75,\"0\"))","v":0},null,null,null,null,null,"Below 60 Years",null,"Above 3 lakh, upto 6 Lakh, 5%",null,{"$f":"IF(R281>300000,15000,R281*0.05)","v":0},{"$f":"Q280-600000","v":-600000},{"$f":"Q282","v":0}]
[null,null,"LESS TAX CREDIT  10% of Taxable income, maximum 2000 is available (Available only if Taxable income is less than 500001)",null,null,null,{"$f":"'new statement'!R61","v":0}]
[3,null,"ABOVE 5 LAKH UP TO 10 LAKH 20%",null,null,null,{"$f":"IF(G279=M282,'new form 16'!N76,IF(taxplanning!G279=taxplanning!M284,'new form 16'!S76,'new form 16'!W75))","v":0},null,null,null,null,null,"60 to 79 Years",null,"Above 6 lakh, upto 9 Lakh, 10%",null,{"$f":"IF(Q280<600000,0,IF(R282>300000,30000,R282*0.1))","v":0},{"$f":"Q280-900000","v":-900000},{"$f":"Q284","v":0}]
[4,null,"ABOVE 10 LAKH 30%",null,null,null,{"$f":"IF(G279=M282,'new form 16'!N77,IF(taxplanning!G279=taxplanning!M284,'new form 16'!S77,'new form 16'!W76))","v":0},null,null,null,null,null,"80 and above",null,"Above 9 lakh, upto 12 Lakh, 15%",null,{"$f":"IF(R284<0,0,IF(R284>300000,45000,(R284)*0.15))","v":0},{"$f":"Q280-1200000","v":-1200000},{"$f":"Q285","v":0}]
[5,null,"TOTAL TAX AMOUNT (1+2+3+4)",null,null,null,{"$f":"G281+G282+G284+G285","v":0},null,null,null,null,null,null,null,"Above 12 lakh, upto 15 Lakh, 20%",null,{"$f":"IF(R286<0,0,IF(R285>300000,60000,R285*0.2))","v":0},{"$f":"Q280-1500000","v":-1500000},{"$f":"Q286","v":0}]
[6,null,"Section 87-A Rebate, maximum 12500 is available (Available only if Taxable income is less than 500001) Section 87-A",null,null,null,{"$f":"'new statement'!R61","v":0},null,null,null,null,null,null,null,"Above 12.5 lakh, upto 15 Lakh, 25%",null,null,null,null,null,"115bac(1A) calculation","out put tax after 115bac 1A"]
[7,null,"EDUCATION CESS 4% OF",null,{"$f":"G286-G287","v":0},null,{"$f":"'new statement'!R63","v":0},null,null,null,null,null,null,null,"Above 15 lakh, 30%",null,{"$f":"IF(R286<0,0,R286*0.3)","v":0},null,{"$f":"Q288","v":0},"taxable inc",{"$f":"Q280","v":0}]
[8,null,"Less 89(1) Relief for arrears of salary",null,null,null,{"$f":"'new statement'!R65","v":0},null,null,null,null,null,null,null,"Total Tax amount before 87 A relief",null,{"$f":"(Q282+Q284+Q285+Q286+Q287+Q288)","v":0},null,{"$f":"Q289","v":0},"87a cutoff",700000]
[9,null,"Total tax due in the year (5-6+7-8)",null,null,null,{"$f":"'new statement'!R66","v":0},null,null,null,null,null,null,null,"Section 87-A Rebate, maximum 25000 is available (Available only if Taxable income is less than 700001) Section 87-A (Marginal relief may be applicable, see notes below) *",null,{"$f":"'new statement (2)'!R61","v":0},null,{"$f":"IF(S294=Q294,Q290,S289-(V293*96/100))","v":0},"difference",{"$f":"IF(U289>U288,0,U288-U289)","v":0}]
[null,null,null,null,null,null,null,null,null,null,null,null,null,null,"Education cess 4% of tax after 87 A relief ",null,{"$f":"'new statement (2)'!R63","v":0},null,{"$f":"(S289-S290)*0.04","v":0}]
[null,null,null,null,null,null,null,null,null,null,null,null,null,null,null,null,null,null,null,"tax",{"$f":"Q294","v":0}]
[null,null,null,null,null,null,null,null,null,null,null,null,null,null,"Less 89(1) Relief for arrears of salary",null,{"$f":"'new statement (2)'!R65","v":0},null,{"$f":"Q293","v":0},"modi tax",{"$f":"U290*1.04","v":0},{"$f":"MIN(U292,U293)","v":0}]
[null,null,null,null,null,null,null,null,null,null,null,null,null,null,"Total Tax due for the year",null,{"$f":"'new statement (2)'!R66","v":0},null,{"$f":"V293-Q293","v":0},"marginal relief",{"$f":"Q294-U293","v":0}]
[]
[]
[]
[]
[]
[null,null,null,null,null,null,null,null,null,null,null,null,null,null,{"$f":"IF(U294>0,\"* Marginal relief U/S 115 BAC(1A) - is applicable-clik the box below to read more\",\"Not applicable to you\")","v":"Not applicable to you"}]
[null,null,"INCOME TAX RATES - FINANCIAL YEAR 2023-24 (OLD REGIME)"]
[null,null,"MALE    &    FEMALE (Below 60 years of age)"]
[null,null,"Upto  2,50,000",null,null,null,null,null,"NIL"]
[null,null,"2,50,001  To  5,00,000",null,null,null,null,null,0.05]
[null,null,"5,00,001  To  10,00,000",null,null,null,null,null,0.2]
[null,null,"10,00,001 and Above",null,null,null,null,null,0.3]
[null,null,"Special rebate (87-A)Upto a maximum of Rs. 12500/- is available if Taxable income is 5 lakh or less. Section 87-A"]
[]
[]
[]
[]
[]
[]
[]
[null,null,"INCOME TAX RATES - FY 2023-24 (SENIOR CITIZEN AND SUPER SENIOR CITIZEN) (OLD REGIME option 1 only)"]
[null,null,"MALE    &    FEMALE  (Above 60 years of age group)",null,null,null,null,null,null,"Age 60 Years or more but less than 80",null,null,null,null,null,"Age 80 Years and above"]
[null,null,"Upto  300,000",null,null,null,null,null,null,"NIL",null,null,null,null,null,"NIL"]
[null,null,"3,00,001  To  5,00,000",null,null,null,null,null,null,0.05,null,null,null,null,null,"NIL"]
[null,null,"5,00,001  To  10,00,000",null,null,null,null,null,null,0.2,null,null,null,null,null,0.2]
[null,null,"10,00,001 and Above",null,null,null,null,null,null,0.3,null,null,null,null,null,0.3]
[null,null,"Special rebate (87-A)Upto a maximum of Rs. 12500/- is available if Taxable income is 5 lakh or less. Section 87-A"]

{"sheet":"print","index":7,"n_rows":41,"n_cols":19,"rows_kept":41,"cut":false,"hidden":false,"merged":[[14,13,14,15],[40,2,40,12],[37,4,37,12],[38,4,38,12],[39,4,39,12],[36,0,36,12],[2,11,2,12],[16,2,16,10],[11,2,11,10],[15,2,15,10],[6,2,6,10],[7,2,7,10],[13,2,13,10],[14,2,14,10],[1,16,2,19],[29,2,29,10],[3,2,3,12],[26,2,26,10],[5,2,5,10],[12,2,12,10],[9,2,9,10],[10,2,10,10],[2,13,2,14],[5,11,5,12],[12,13,13,15],[16,11,16,12],[1,1,1,12],[8,2,8,10],[28,11,28,12],[2,4,2,10],[35,16,35,19],[18,14,18,15],[18,11,18,12],[26,11,26,12],[27,11,27,12],[31,2,31,12],[28,2,28,10],[27,2,27,10]]}
[null,null,{"$f":"\"Dear \"&PERSONAL!H4 &\", Your data entry is over \"","v":"Dear , Your data entry is over "},null,null,null,null,null,null,null,null,null," SAVE",null,null,null,{"$f":"'Form 10E'!H40","v":0},{"$f":"'Form 10E NEW REG'!H40","v":0},{"$f":"Q1+R1","v":0}]
[]
[null,null,{"$f":"'new statement'!#REF!","v":{"$error":"#REF!"}},null,"MENU",null,null,null,null,null,null,null,null,{"$f":"'new statement'!R70","v":0}]
[null,null,"Click the following buttons to view or Print different documents",null,null,null,null,null,null,null,null,null,null,"Page 6"]
[]
[1,null,"10 E Form Preparation ( To check 89(1) relief if any കുടിശ്ശികയായി കിട്ടിയ ശമ്പളത്തിന് ഇളവുണ്ടോ എന്ന് പരിശോധിക്കുവാന്‍ ക്ലിക്ക് ) ",null,null,null,null,null,null,null,null,null,null,"ANTICIPATORY TAX CALCULATOR"]
[2,null,"VIEW   INCOME TAX STATEMENT "]
[3,null,"PRINT   INCOME TAX STATEMENT (2 A4 sheets) (ആദ്യ ബട്ടണില്‍ ക്ലിക്ക് ചെയ്ത് Page 1 ഉം മറുവശത്ത് Page 2 ഉം)"]
[2,null,"VIEW / PRINT  INCOME TAX  STATEMENT (To choose the best option, Click the Green button.  ) പച്ച ബട്ടൺ ക്ലിക് ചെയ്യുക-  ANTICIPATORY CALCULATOR or TAX CALCULATOR എന്ന ഓപ്ഷനും മാറ്റിയിടാം ",null,null,null,null,null,null,null,null,{"$f":"INVEST!$K$3","v":0},{"$f":"INVEST!$L$3","v":0},"TAX CALCULATOR",null,"ANTICIPATORY TAX CALCULATOR"]
[3,null," PRINT   INCOME TAX STATEMENT  (2 A4 sheets) (ആദ്യ ബട്ടണില്‍ ക്ലിക്ക് ചെയ്ത് Page 1 ഉം മറുവശത്ത് Page 2 ഉം)"]
[4,null," VIEW FORM 16- B PART ( FORM 16-B part കാണാന്‍ )"]
[5,null," PRINT FORM 16- B PART (2 A4 sheets)  ഫോം 16 പ്രിന്റ്‌ എടുക്കാന്‍   "]
[6,null,"VIEW 10-E FORM set  [ കുടിശ്ശിക ശമ്പളത്തിന്റെ ഇളവിനുള്ള ഫോം  ] ",null,null,null,null,null,null,null,null,null,null,{"$f":"IF('arrear det'!K100>0,\"CAUTION ! Never take Form 10 E printouts from this utility. You have choosen the option to calculate it manually, otherwise click menu No. 1 and deactivate the option by editing the filed. \",IF('Form 10E'!H40>0,\"Since you are benifited with rebate on arrear, you have to submit 10 E form, previous years's Tax statements with current years IT statement.  Click the green button on the left side\",\"\"))","v":""}]
[{"$f":"IF(C14=\"\",\"\",\"2-(a)\")","v":"2-(a)"},null,{"$f":"IF('ARREAR SPLIT'!N22=0,\"Skip this menu- ഈ മെനു താങ്കൾക്ക് ബാധകമല്ല \",IF(S1>0,\"Click Green button on right side to VIEW / PRINT 10 E form set വലതു വശത്ത് കാണുന്ന പച്ച ബട്ടൺ ക്ലിക് ചെയ്തു 10 E form set പ്രിൻറ് എടുക്കുക \",\" 89(1) relief is NOT available to you, No need to take 10 E print -89(1) relief റിലീഫ് ലഭ്യമല്ലാത്തതിനാൽ 10 E പ്രിൻറ് എടുക്കേണ്ടതില്ല\"))","v":"Skip this menu- ഈ മെനു താങ്കൾക്ക് ബാധകമല്ല "},null,null,null,null,null,null,null,null,{"$f":"IF(L9>=M9,\"\",\"10 E Form CLICK ME\")","v":""},{"$f":"IF(L9<=M9,\"\",\" 10 E Form CLICK ME\")","v":""}]
["2 (b)",null,{"$f":"IF(L15>1,\"VIEW or PRINT Monthly arrear split up details (കുടിശികയുടെ മാസം തിരിച്ചുള്ള പട്ടിക)\",\"Skip this menu ഈ മെനു താങ്കൾക്ക് ബാധകമല്ല \")","v":"Skip this menu ഈ മെനു താങ്കൾക്ക് ബാധകമല്ല "},null,null,null,null,null,null,null,null,{"$f":"'ARR MONH SPLIT'!AD63-'ARR MONH SPLIT'!AD26","v":0},{"$f":"L15","v":0},{"$f":"'Form 10E NEW REG'!Q1","v":""}]
[3,null,"VIEW/ FILL/ PRINT FORM 12 BB (ഫോം 12 BB പൂരിപ്പിക്കാന്‍) "]
[4,null," KNOW HOW YOUR TAX AMOUNT IS CALCULATED താങ്കളുടെ നികുതി തിട്ടപ്പെടുത്തിയത്‌ എങ്ങിനെ ?"]
[10]
[11]
[12]
[13]
[14]
[15]
[16]
[17]
[18]
[19,null,"TIPS TO REDUCE TAX (നികുതി കുറക്കാന്‍ തന്ത്രങ്ങള്‍)"]
[5,null,"TAX RATES OF PREVIOUS YEARS (മുന്‍കാല നികുതി നിരക്കുകള്‍)"]
[6,null,"TO SAVE THIS FILE SAFELY,  (ഈ ഫയല്‍ സുരക്ഷിതമായി സേവ് ചെയ്യേണ്ട സ്ഥലത്തെത്താന്‍ വലത്തുവശത്തു കാണുന്ന SAVING BUTTON  ക്ലിക്ക് ചെയ്യുക "]
[]
[]
[null,null,"ഈ ഫയല്‍ സേവ് ചെയ്യാന്‍ ഒരിക്കലും FILE SAVE/ FILE SAVE AS രീതികള്‍ ഉപയോഗിക്കരുത് മുകളിൽ കാണുന്ന saving  button  ഉപയോഗിക്കുക.  തിരുത്തലുകള്‍ വേണമെങ്കില്‍ പിന്‍ പേജില്‍ പോയി തിരുത്താവുന്നതാണ്"]
[]
[]
[]
[]
[]
[null,null,null,null,{"$f":"\"THIS FILE CAN BE USED JUST TO PRINT/EDIT THE DATA OF  \"&B2","v":"THIS FILE CAN BE USED JUST TO PRINT/EDIT THE DATA OF  "}]
[null,null,null,null,"If you are using this file to estimate tax of a different person, it may show wrong results."]
[null,null,null,null,"TO FIND TAX  OF A DIFFERENT PERSON,  USE THE MASTER FILE OF ECTAX 2013 DOWNLOADED"]
[null,null,"If you cant see closing button of the programme  please click here"]

{"sheet":"INVEST","index":8,"n_rows":125,"n_cols":15,"rows_kept":125,"cut":false,"hidden":false,"merged":[[2,1,2,5],[3,3,3,4],[15,3,15,4],[28,3,28,4],[28,6,28,7],[24,1,24,5],[22,6,22,7],[25,3,25,4],[12,6,13,7],[9,6,11,7],[4,3,4,4],[13,3,13,4],[17,6,17,11],[1,12,2,12],[0,7,0,9],[0,3,0,4],[31,1,31,5],[26,3,26,4],[27,3,27,4],[18,3,18,4],[17,3,17,4],[30,3,30,4],[20,3,20,4],[16,3,16,4],[1,1,1,5],[14,3,14,4],[0,1,0,2],[29,3,29,4],[21,6,21,7]]}
[null,null,null,{"$f":"PERSONAL!H4&\" Congratulations ! !, This is the last page for data entry. \"&\" Now, the balance of tax payable by you is Rs. \"&N1&O1","v":" Congratulations ! !, This is the last page for data entry.  Now, the balance of tax payable by you is Rs. 0 (Refund)"},null,null,null,{"$f":"taxplanning!N7","v":""},null,null,{"$f":"'new statement'!R70","v":0},{"$f":"'new statement for PRINT'!R70","v":0},null,{"$f":"MIN(K1,L1)","v":0},{"$f":"IF(N1<1,\" (Refund)\",\"\")","v":" (Refund)"}]
[null,{"$f":"\"TAX SAVING INVESTMENTS & PAYMENTS  OTHER THAN SALARY CUTTING OF  \"& PERSONAL!H4","v":"TAX SAVING INVESTMENTS & PAYMENTS  OTHER THAN SALARY CUTTING OF  "},null,null,null,null,null,null,null,null,"OPTION 1- OLD RATE Rs.","OPTION 2- NEW RATE Rs.",{"$f":"IF(K3>L3,\"CLICK option 2 Green box as it is the best choice\",IF(K3<L3,\"CLICK option 1 Green box as it is the best choice\",\"TAX IS SAME IN BOTH CASES. CLICK OPTION 1 OR OPTION 2 \"))","v":"TAX IS SAME IN BOTH CASES. CLICK OPTION 1 OR OPTION 2 "}]
[null,"  ഓരോ നിക്ഷേപങ്ങളുടെയും സാദ്ധ്യതകളെപ്പറ്റിയും ഇളവുകളെക്കുറിച്ചും അറിയാന്‍ അതതു നിക്ഷേപത്തിന്റെ തുകയെഴുതുന്ന സ്ഥാനത്ത് മൌസ് വച്ചു നോക്കുക ",null,null,null,null,"Page 5",{"$f":"\"Now your total 80 C / CC / CCD investment is Rs \"&'new statement'!O45","v":"Now your total 80 C / CC / CCD investment is Rs 0"},null,null,{"$f":"'new statement'!R66","v":0},{"$f":"'new statement for PRINT'!R66","v":0}]
[null,15000,"Section","Investments/ Payments Maximum 1,50,000 allowed (പരമാവധി 1.5 ലക്ഷം വരെ ഇളവുള്ളവ)",null,"AMOUNT RS.",{"$f":"\"Balance of tax \"&'new statement'!R70&\"\"","v":"Balance of tax 0"}]
[null,1,"80 C","ANNUAL LIFE INSURENCE PREMIUM (other than salary deduction) (വേതനത്തില്‍ നിന്നുള്ള പിടുത്തം അല്ലാത്ത എല്ലാ Life insurence ന്റെയും വാര്‍ഷിക അടവ് നിശ്ചയിച്ചിരിക്കുന്നത് കൂട്ടിച്ചേര്‍ത്ത് കാണിക്കുക ) Include all Post office PLI, Pvt. Life insurance premium taken in the name of self/ spouse/ children ",null,null,{"$f":"\"Now your total 80 C / CC / CCD investment is Rs \"&'new statement'!O45","v":"Now your total 80 C / CC / CCD investment is Rs 0"}]
[null,2," 80CCC","LIFE INSURANCE PENSION SCHEMES premium annual total . Eg. LIC Pension Scheme",null,null,{"$f":"SUM(F6:F6)","v":0}]
[null,3,"80 C","NSC VIII th issue (Nationional Savings certificate from post offices)  "]
[null,4,"80 C","TAX SAVING Fixed deposits (Available at all Banks)/  Sukanya Samrudhi Investment"]
[null,5,"80 C","PPF (Public provident fund accounts of Postoffice etc.)  "]
[null,6," 80C","ULIP/ Tax saving mutual funds (Share trading firms) ",null,null,{"$f":"IF('det.sal input'!U26>1,\"\",IF('new statement'!O45>149999,\"Dear  \"&PERSONAL!H4&\", Your 80-C  1.5 LAKH INVESTMENT LIMIT is over.  Additional investment in NPS upto 50000 is possible\",\"\"))","v":""}]
[null,7,"80 C","TUITION FEE PAID FOR CHILDREN (Only for 2 children, for full time courses only)  80C"]
[null,8,"80 C","HOUSING LOAN PRINCIPAL PORTION repayment (Not allowed for repair loan ) Pl. see point 12 to add interest"]
[null,9,"80 C","Any other 80 C deductions (specify name of such investment  here)  ----->"]
[null,null,"Sec","Investments/ Payments over 1,50,000 (1.5 ലക്ഷത്തിനു മേല്‍ ഇളവു ലഭിക്കുന്നവ)",null,"AMOUNT RS."]
[null,10,"80 CCD","Contribution to NPS other than salary deduction. (ശമ്പളത്തില്‍ നിന്നുള്ള കിഴിവല്ലാതെ തൊഴിലാളി നേരിട്ടടക്കുന്ന നിക്ഷേപം ഉണ്ടെങ്കില്‍ മാത്രം ഇവിടെ എഴുതുക) Rs. 50000 Extra investement is possible (കൂടുതലായി Rs. 50000 വരെ നിക്ഷേപിക്കാം) "]
[null,11,"80 EEB","Electric Vehicle Loan Interest repayment (Maximum 1.5 lakh allowed)"]
[null,11,"24b","HOUSING LOAN  INTEREST due Normally Up to 2 Lakh allowed.  (For repair loan  30000)"]
[null,12,"80D","MEDICAL INSURANCE PREMIUM [For the group 'wife+husband+children, up to Rs.25000, another 25000(Senior citizen parent 50000) for parents] and  PREVENTIVE HEALTH CHECK UP Exp UP TO Rs 5000 included in the above",null,{"$f":"'MEDI INS OTHER DED'!Q16","v":0}]
[null,13,"80 G","DONATIONS/ FLOOD RELIEF FUND  [ to specified institutions by consolidated cheque through DDO ( type only allowed portion) ] salary deduction ആയി നല്‍കിയ തുകകള്‍ ഇവിടെ കാണിക്കരുത്"]
[null,14,"80E","EDUCATION LOAN INTEREST  (Interest repayment portion only)"]
[null,15,"80DD","Treatment of dependant with disability  (വിശദാംശങ്ങള്‍ക്ക് തുക  എഴുതുന്നിടത്ത് മൗസ് വക്കുക) "]
[null,16,"80 DDB","MEDICAL EXPENCE for specified diseases of Self / dependent (Only for chronic diseases)"]
[null,17,"80 U","BLIND & DIFFERENTLY ABLED  persons' deduction"]
[null,19,"89 (1)","Relief for Arrears of salary if any"]
[null,{"$f":"IF('det.sal input'!H26+'det.sal input'!I26+'det.sal input'!J26+'det.sal input'!K26=0,\"YOU ARE NOT NEEDED TO FILL THE AREAS BELOW - ചുവടെ ഒന്നും പൂരിപ്പിക്കേണ്ടതില്ല\", \" CHECK ALLOWANCES EXEMPTED FROM TAX IF ANY - താങ്കള്‍ വാങ്ങിയ അലവന്‍സ് നു ഇളവിന് അര്‍ഹതയുണ്ടോ എന്ന് പരിശോധിക്കുക \")","v":"YOU ARE NOT NEEDED TO FILL THE AREAS BELOW - ചുവടെ ഒന്നും പൂരിപ്പിക്കേണ്ടതില്ല"}]
[null,null,null,{"$f":"IF('det.sal input'!H26+'det.sal input'!I26+'det.sal input'!J26+'det.sal input'!K26=0,\"SKIP THIS FIELD- ചുവടെ വായിക്കേണ്ടതില്ല\",D33)","v":"SKIP THIS FIELD- ചുവടെ വായിക്കേണ്ടതില്ല"}]
[null,null,null," Name of allowance with excemption under section 10",null,"Exempted amount Rs"]
[null,18,"S-10",{"$f":"IF('det.sal input'!H6=\"?\",\"\",'det.sal input'!H6)","v":""},null,null,null,null,null,null,{"$f":"'det.sal input'!H26","v":0}]
[null,19,"S-10",{"$f":"IF('det.sal input'!I6=\"?\",\"\",'det.sal input'!I6)","v":""},null,null,null,null,null,null,{"$f":"'det.sal input'!I26","v":0}]
[null,20,"S-10",{"$f":"IF('det.sal input'!J6=\"?\",\"\",'det.sal input'!J6)","v":""},null,null,null,null,null,null,{"$f":"'det.sal input'!J26","v":0}]
[null,21,"S-10",{"$f":"IF('det.sal input'!K6=\"?\",\"\",'det.sal input'!K6)","v":""},null,null,null,null,null,null,{"$f":"'det.sal input'!K26","v":0}]
[]
[null,null,null,"Certain allowances enjoy benefit of tax excemption. To read more about it, please point mouse near the right side GREEN BOX.  FILL THE  BELOW AREA, ONLY IF YOU ARE BENIFITED WITH THE EXEMPTION (താങ്കള്‍  ശമ്പളമായി വാങ്ങിയ ചിള അലവന്‍സുകള്‍ക്ക്  section 10 പ്രകാരം ഇളവുണ്ടായേക്കാം. വിശദാംശങ്ങള്‍ അറിയാന്‍ വലത്തുവശത്തു കാണുന്ന പച്ച പ്രദേശത്ത് മൗസ് വച്ച് വായിക്കുക ഇളവിന് അര്‍ഹതയുണ്ടെങ്കില്‍ മാത്രം  ചുവടെ കാണിക്കുക"]
[]
[null,{"$f":"IF(F28>0,D28,\"\")","v":""}]
[null,{"$f":"IF(F29>0,D29,\"\")","v":""}]
[null,{"$f":"IF(F28+F29:F310,\" + \",\"\")","v":""}]
[]
[]
[]
[]
[]
[]
[]
[]
[]
[]
[]
[]
[]
[]
[]
[]
[]
[]
[]
[null,"HOUSING LOAN AND INCOME TAX -  FREQUENTLY ASKED QUESTIONS"]
[null,"There are many instances where a residential plot/property has been acquired/owned by wife and later through bank finance,"]
[null,"construction or further renovation starts. Some cases wife has no income, so husband makes all the repayment of principal and interest towards"]
[null,"the borrowed capital. Now the question arise; is the husband eligible to get interest & principal deductions u/s 24b & 80C respectively"]
[null,"even though he is not the owner of the property?"]
[null,"To answer to the above question, first you need to understand how the property was actually acquired and "]
[null,"what is the loan structure (like holder/holders of the loan)?"]
[null,"Situation 1: The property might have been acquired by wife through gift from parents or inheritance property."]
[null,"In such case any loan taken jointly with husband or singly, husband will not be entitled to get any tax benefits of principal repayment u/s 80C "]
[null,"and interest deduction u/s 24b even if he serve the loan repayment from his income. It doesn’t matter whether husband makes "]
[null,"all (or part of) the repayments. It is even immaterial whether he is a first applicant or sole applicant or not an applicant at all. To claim tax benefits,"]
[null,"husband needs to be the owner (or co-owner) of the property."]
[null,"The solution may be; if both the spouse enter into an agreement where wife declares to sell and transfer part of the ownership of the house property to husband,"]
[null,"then husband will be able to claim the tax benefit. Such sell/transfer requires prior permission of the lender."]
[null,"Situation 2: The property has been acquired in the name of wife only, but source of fund is husband."]
[null,"Here the fact is that the property may have been purchased in wife’s name may not mean that the property belongs to her. If the said house property has been "]
[null,"purchased out of husband’s own funds (but property in wife’s name) then husband becomes the actual owner of the property. To claim income tax deduction,"]
[null," husband needs to make a declaration with the Assessing Officer (AO) under Benami Transaction Act 1998, stating that he is the real owner of the property"]
[null,"though registered in his wife’s name. Once it is done, he will entitled to all deductions available to an owner of the Property relating to "]
[null,"repayment and interest on housing loan under the Act."]
[null,"B – Husband and wife are co-owners of house property and also co-applicants of Home Loan, but all the repayments are being done by husband alone: "]
[null,"(or EMI is paid partially by husband and other part by wife)"]
[null,"In this scenario, husband can very well claim income tax exemption as specified under the act. If the husband is the only person repaying the loan,"]
[null,"then he can claim the entire tax benefit for himself (provided he is an owner or co-owner). Both the spouse should enter into a simple agreement"]
[null,"where wife should be stating that husband will be repaying the entire loan. This applies vice-versa where husband and wife are co-owners of house"]
[null,"property and also co-applicants of Home Loan, but all the repayments are done by wife alone. If you are paying part of the EMI, you will get tax benefits in the "]
[null,"proportion to your share in the loan."]
[null,"It is immaterial what the repayment mode is with regards to avail deductions. EMIs can be served from a joint account, from two different accounts"]
[null,"owned by each co-applicant respectively or from a single account either from husband or wife."]
[]
[]
[]
[]
[]
[]
[]
[]
[]
[]
[]
[]
[]
[]
[]
[]
[]
[]
[]
[null,"NPS (NATIONAL PENSION SYSTEM)  INVESTMENTS AND TAX EXEMPTION"]
[null,"Normally one person can invest upto Rs. 1.5 Lakh in LIC, PF, Tax saving FD, NSC, PPF etc. to reduce Tax burden"]
[null,"In the current  Financial year (2019-20 additional 50000 investment opportunity is provided in NPS , there by the investment limit can be extended up to Rs. 2 lakh "]
[null,"A person in 20% Tax slab can reduce his tax liability upto Rs. 10400 by choosing NPS as an investment option. The benifit is Rs. 15600 for one in 30% Tax slab !!"]
[null,"Same time the investment is subject to certain limitations. To read more, switch on internet and click on the following link :"]
[]
[null,"RAJIV GANDHI EQUITY SCHEME "]
[null,"The deduction under this section in accordance with RGESS 2013 is available if following conditions are satisfied: "]
[null,null,"(a) The assessee is a resident individual "]
[null,null,"(b) His gross total income does not exceed Rs. 12 lakhs"]
[null,null,"(c) He has acquired listed shares in accordance with a notified scheme or listed units of an equity oriented fund as defined in section 10(38)"]
[null,null,"(d) The assessee is a new retail investor"]
[null,null,"(e) The investment is locked-in for a period of 3 years from the date of acquisition in accordance with the above scheme"]
[null,null,"f) The assessee satisfies any other condition as may be prescribed"]
[null,"Amount of deduction –The amount of deduction is at 50% of the amount invested in equity shares/units. "]
[null,"However, the amount of deduction under this provision cannot exceed Rs. 25,000"]
[null,"Withdrawal of deduction – If the assessee, after claiming the aforesaid deduction, fails to satisfy the above conditions, "]
[null,"the deduction originally allowed shall be deemed to be the income of the assessee of the year in which default is committed. "]
[null,"This deduction is allowed for three consecutive assessment years beginning with the AY"]
[null," in which the listed equity shares or units were first acquired. If any deduction is claimed by a taxpayer under this section in any year,"]
[null," he shall not be entitled to any deduction under this section for any other year."]

{"sheet":"CUSTOMISE","index":9,"n_rows":36,"n_cols":18,"rows_kept":36,"cut":false,"hidden":false,"merged":[[22,7,22,11],[24,7,24,11],[23,2,23,6],[15,1,15,11],[21,7,21,11],[23,7,23,11],[24,2,24,6],[41,8,41,11],[27,7,27,11],[26,2,26,4],[26,7,26,11],[25,7,25,11],[40,6,40,11],[25,2,25,4],[27,2,27,4],[37,9,37,11],[39,5,39,11]]}
[]
[]
[]
[]
[]
[]
[]
[]
[null,"PAGE NO. 1"]
[]
[]
[]
[]
[]
[]
[null,"TYPE DETAILS OF YOUR OFFICE IN ENGLISH   ( എല്ലാ വിവരങ്ങളും ഇംഗ്ലീഷില്‍ നല്‍കുക)"]
[]
[]
[]
[]
[]
[null,1,"NAME OF YOUR OFFICE  (Use capital letters)",null,null,null,null,null,null,null,null,null,null,null,null,null,null,"SELECT HRA CLASS"]
[null,2,"PLACE OF OFFICE",null,null,null,null,null,null,null,null,null,null,null,null,null,null,"CORPORATION"]
[null,3,"NAME OF YOUR DDO (Office chief) [Gazetted officers should type name of Treasury officer]  DDO എന്നതുകൊണ്ട്‌ ഉദ്ദേശിക്കുന്നത് അതതു സ്ഥാപനങ്ങളിലെ ശമ്പളം വിതരണം ചെയ്യുന്ന മേധാവിയാണ്. വിദ്യാലയങ്ങളില്‍ HM or PRINCIPAL ",null,null,null,null,null,null,null,null,null,null,null,null,null,null,"MUNICIPALITY DISTRICT HQ"]
[null,4,"SELECT HRA CLASS OF YOUR INSTITUTION (നിങ്ങളുടെ ഓഫീസ് സ്ഥിതി ചെയ്യുന്ന മേഖലയുടെ തരം തെരഞ്ഞെടുക്കുക. വിരമിച്ച ജീവനക്കാർ, സ്വകാര്യ ജീവനക്കാർ,. HRA ആനുകൂല്യം ഇല്ലാത്ത ജീവനക്കാർ എന്നിവർ  'SELECT HRA CLASS' എന്ന ഓപ്ഷൻ മാറ്റാതെ അതേ പടി തുടരുക )",null,null,null,null,"SELECT HRA CLASS",null,null,null,null,null,null,null,null,null,"MUNICIPALITY"]
[null,5,{"$f":"H24","v":0},null,null,"DESIGNATION",null,null,null,null,null,null,null,null,null,null,null,"PANCHAYATH"]
[null,5,{"$f":"C26","v":0},null,null,"PAN (If not known, leave it blank)"]
[null,6,{"$f":"C27","v":0},null,null,"TAN (OFFICE TAN) (If not known, leave it blank)"]
[null,null,null,null,null,null,null,null,null,null,null,"Thanks to Maths blog Team,  HSS Live blog, Hari, Adheesh T V, Simon Kattore, Muhammad AP,  Shameem C H"]
[]
[null,{"$f":"IF(H24=\"\",\"\",IF(H25=R22,\"Caution ! Your have to select the HRA class of your institution, Please select the locality of your office in  point 4\",\"\"))","v":""}]
[]
[]
[]
[]
[null,{"$f":"IF(H24=\"\",\"\",IF(H25=R22,\"A retired staff, staff without HRA benefit or Private staff can ignore the above error message\",\"\"))","v":""}]

{"sheet":"PERSONAL","index":10,"n_rows":452,"n_cols":21,"rows_kept":452,"cut":false,"hidden":false,"merged":[[12,14,12,17],[9,3,9,6],[25,3,25,7],[26,9,26,12],[28,3,28,7],[0,3,0,7],[8,3,8,6],[13,2,13,4],[2,1,2,7],[22,7,22,12],[3,3,3,6],[16,3,16,6],[4,3,4,6],[7,3,7,6],[14,2,14,4],[15,2,15,4],[19,3,19,6],[12,3,12,6],[21,3,21,6],[42,0,55,0],[24,6,24,12],[45,7,45,11],[18,12,18,13],[20,3,20,6],[43,7,43,10],[18,3,18,6],[52,7,52,9],[47,7,47,11],[42,7,42,10],[23,6,23,12],[47,1,47,6],[43,2,43,6],[46,7,46,11]]}
[null,"PAGE 2",null,{"$f":"G24","v":"ECTAX - 2024,   Version"},null,null,null,null,null,null,null,null,null,null,null,"Below 60 Years",null,null,null,null,1]
[null,null,null,null,null,null,"Scroll mouse to see continue button","Scroll mouse to see continue button",null,null,null,null,null,null,null,"60 to 79 Years",null,null,"Email: babuvadukkumchery@gmail.com",null,2]
[null,"SHOW YOUR PERSONAL DETAILS HERE ( വ്യക്തിപരമായ വിവരങ്ങള്‍ ഇവിടെ ) ",null,null,null,null,null,null,null,null,null,null,null,null,null,"80 and above","March 2014 bill, Cash receipt in April 2014",null,"Financial year 2023-24",null,3]
[null,1,null,"YOUR NAME in English language - [ To refresh,  click blue button on the top - മുന്‍വ്യക്തിയുടെ വിവരങ്ങള്‍ മായ്ക്കാന്‍ മുകളിലെ നീല ബട്ടന്‍ (circle)  ക്ലിക്ക്ചെയ്യുക. അത് ചെയ്യുമ്പോള്‍ മുന്‍പ് സേവ് ചെയ്തിരുന്ന വ്യക്തിയുടെ വിവരങ്ങള്‍ നഷ്ടപ്പെടുകയോ തിരുത്തുകയോ ചെയ്യുന്നില്ല] ",null,null,null,null,null,null,null,null,null,"MALE",null,null,"April 2014 bill, Cash receipt in May 2014",null,"Click to close",null,4]
[null,2,null,"AGE (1942 ഏപ്രില്‍ 1 നും 1962 മാര്‍ച്ച് 31 നും ഇടയില്‍ ജനിച്ചവര്‍ 60-79 വിഭാഗത്തില്‍പെടുന്നു.  1942 ഏപ്രില്‍ 1 നു മുന്‍പ് ജനിച്ചവര്‍ 80 AND ABOVE വിഭാഗത്തില്‍പെടുന്നു ) Select age from options",null,null,null,"Below 60 Years",null,null,null,null,null,null,null,null,"May 2014 bill, Cash receipt in June 2014",null,null,null,5]
[null,3,null,"DESIGNATION",null,null,null,null,null,null,null,null,null,"SENIOR CITIZEN",null,null,"June 2014 bill, Cash receipt in July 2014"]
[null,4,null,"PAN",null,null,null,null,null,null,null,null,null,null,null,null,null,null,null,null,7]
[null,5,null,"ARE YOU LIVING IN A RENTAL HOME ?  (വാടക വീട്ടിലാണോ താമസം?)",null,null,null,"NO",null,null,null,null,"YES",null,null,null,null,null,null,null,8]
[null,6,null,{"$f":"IF(H8=\"NO\",\"You can skip this field താങ്കള്‍ ഇവിടെ ഒന്നും എഴുതേണ്ടതില്ല\",\"Amount of ANNUAL rent payable during 2022 April to 2023 March Rs. (2023 ഏപ്രില്‍ തുടങ്ങി 2024 മാര്‍ച്ച് വരെ നല്‍കേണ്ട 12 മാസ വീട്ടുവാടക എഴുതുക)  \")","v":"You can skip this field താങ്കള്‍ ഇവിടെ ഒന്നും എഴുതേണ്ടതില്ല"},null,null,null,null,null,null,null,null,"NO",null,null,null,null,null,null,null,9]
[null,"1A",null,{"$f":"\"Dear \"&H4&\" , Are you Retired ? - Salary ആണോ Pension ആണോ വാങ്ങുന്നതെന്ന്  ഓപ്ഷനിൽ നിന്നും തെരഞ്ഞെടുക്കുക \"","v":"Dear  , Are you Retired ? - Salary ആണോ Pension ആണോ വാങ്ങുന്നതെന്ന്  ഓപ്ഷനിൽ നിന്നും തെരഞ്ഞെടുക്കുക "},null,null,null,"SALARY",null,null,null,null,null,null,"PENSION","SALARY",null,null,null,null,10]
[null,7,null,"PLACE OF OFFICE",null,null,null,{"$f":"CUSTOMISE!H23","v":0},null,null,null,null,null,null,null,null,null,null,null,null,11]
[null,8,null,"NAME OF YOUR DDO",null,null,null,{"$f":"CUSTOMISE!H24","v":0},null,null,null,null,null,null,null,null,null,null,null,null,12]
[null,7,null,"HRA CLASS OF YOUR OFFICE (It is already selected by you in the previous page- Go back to edit താങ്കൾ നേരത്തേ സെലക്ട് ചെയ്ത HRA ക്ലാസ് ഇതാണ്, മാറ്റം വരുത്താൻ പിൻ പേജിൽ പോകുക അവിടെ Number 4 കാണുക )",null,null,null,{"$f":"CUSTOMISE!H25","v":"SELECT HRA CLASS"},null,null,null,null,null,null,{"$f":"IF(H13=CUSTOMISE!R22,\"Error  ! Please go back, refer Point 4 in back page, and select locality class of your office for HRA calculation. An individual with No HRA can ignore this message\",\"Ensure that the HRA class of your institution is as shown in number 7. An individual with no HRA can ignore this message\")","v":"Error  ! Please go back, refer Point 4 in back page, and select locality class of your office for HRA calculation. An individual with No HRA can ignore this message"}]
[null,10,{"$f":"H12","v":0},null,null,"DESIGNATION",null,{"$f":"CUSTOMISE!H26","v":0}]
[null,11,{"$f":"C14","v":0},null,null,"PAN"]
[null,12,{"$f":"C15","v":0},null,null,"TAN (OFFICE TAN)",null,{"$f":"CUSTOMISE!H28","v":0}]
[null,8,null,"YOUR INCOME TAX TDS CIRCLE (If not known leave it blank )",null,null,null,null,null,null,null,null,null,null,null,null,null,null,null,null,10]
[null,8,null,"ARE YOU A GOVT / AIDED. EMPLOYEE ?",null,null,null,"YES",null,null,null,null,null,null,"YES",null,null,null,null,null,11]
[null,8,null,"DO YOU HAVE TAKEN HOUSING LOAN ? ഭവന വായ്പ്പ എടുത്തിട്ടുണ്ടോ ?",null,null,null,"NO",null,null,null,null,null,null,"NO",{"$f":"IF(H19=\"august 2014 bill, cash receipt in september 2014\",7,IF(H19=\"September 2014 bill, Cash receipt in October 2014\",6,IF(H19=\"October 2014 bill, Cash receipt in November 2014\",5,IF(H19=\"November 2014 bill, Cash receipt in December 2014\",4,IF(H19=\"December 2014 bill, Cash receipt in January 2015\",3)))))","v":false},"September 2014 bill, Cash receipt in October 2014",null,null,null,12]
[null,9,null,{"$f":"IF(H19=\"yes\",\"Please select YES  if ALL OF the following conditions are OK related with the housing loan: 1. loan amount is not above Rs. 35 lakhs,  2.  Loan sanctioned in 2016-17,  3. You are a first time home buyer,   4.  cost of house does not exceed Rs. 50 lakhs\",\"You can skip this field by selecting No\")","v":"You can skip this field by selecting No"},null,null,null,"NO",null,null,null,null,null,null,{"$f":"IF(H19=\"YES\",\"ഏറ്റവും ചുവടെ കാണുന്ന കുറിപ്പ് മൌസ് സ്ക്രോള്‍ ചെയ്ത് വായിക്കുക\",\"\")","v":""}]
[null,10,null,"Number of months remaing in the current financial year including this month, upto Feb-2024 (select from options)    (ഇപ്പോള്‍ ശമ്പള ബില്‍ തയ്യാറാക്കാന്‍ പോകുന്ന  നടപ്പു മാസമടക്കം ഈ സാമ്പത്തീക വര്‍ഷത്തില്‍ ഇനി എത്ര മാസങ്ങള്‍ ഉണ്ട് വലത്തുവശത്തു കാണുന്ന ലിസ്റ്റില്‍നിന്നും തിരഞ്ഞെടുക്കുക) 2023 ഡിസംബർ   മാസത്തെ ശമ്പള ബിൽ സമർപ്പിക്കുമ്പോൾ ഇവിടെ 3   എന്നാണ് നൽകേണ്ടത്. ഫെബ്രുവരി മാസ ബില്ലിൽ 1  എന്നു നൽകാം ",null,null,null,3,null,null,null,null,{"$f":"C21","v":0},null,"before clicking continue,  please read point Ten carefully",null,"October 2014 bill, Cash receipt in November 2014"]
[null,11,null,"Number of months remaing in the current financial year including this month, upto Feb-2021 (select from options)    (ഇപ്പോള്‍ ശമ്പള ബില്‍ തയ്യാറാക്കാന്‍ പോകുന്ന  നടപ്പുമാസമടക്കം ഈ സാമ്പത്തീക വര്‍ഷത്തില്‍ ഇനി എത്ര മാസങ്ങള്‍ ഉണ്ട് വലത്തുവശത്തു കാണുന്ന ലിസ്റ്റില്‍ നിന്നും തെരഞ്ഞെടുക്കുക [ഉദാ.വര്‍ഷത്തിലെ ആദ്യ മാസത്തിലെ ബില്‍ നല്‍കുമ്പോള്‍ 12 എന്നും രണ്ടാം മാസത്തിലെ ബില്ലില്‍ 11 എന്നുമാണ് നല്‍കേണ്ടത് ]",null,null,null,12,null,null,"click to close the programme - പ്രോഗ്രാം ക്ലോസ് ചെയ്യാന്‍",null,null,null,null,null,"November 2014 bill, Cash receipt in December 2014"]
[null,null,null,null,null,null,null,"http://babuvadukkumchery.blogspot.com",null,null,null,null,null,null,null,null,"December 2014 bill, Cash receipt in January 2015"]
[null,null,null,null,null,null,{"$f":"\"ECTAX - 2024, \"&\" \"&CUSTOMISE!H22&\" Version\"","v":"ECTAX - 2024,   Version"}]
[null,null,null,null,null,null,"Babu V A, commerce teacher, KNMVHSS VATANAPPALLY Thrissur"]
[null,9,null,{"$f":"IF(H19=\"no\",\"\",\"മേല്‍ വിവരിക്കുന്ന നിബന്ധനകള്‍ മുഴുവന്‍ പാലിക്കുന്ന പക്ഷം മാത്രം YES എന്ന് നല്‍കുക. ഏതെങ്കിലും ഒരു നിബന്ധന പോലും ശരിയാകുന്നില്ലെങ്കില്‍ NO എന്ന് നല്‍കണം   \")","v":""},null,null,null,null,null,null,null,null,"please mail your comments to babuvadukkumchery@gmail.com or dial 9947009559 for help"]
[]
[]
[null,null,null,{"$f":"IF(D26=\"\",\"\",\"ഈ നിബന്ധനകള്‍ പാലിക്കാത്ത [NO selected ]  loan നും മറ്റ് housing loan കൾക്ക് ലഭിക്കുന്ന  ആനുകൂല്യം ലഭിക്കും. എന്നാല്‍  ഈ നിബന്ധന പാലിക്കപ്പെട്ടാല്‍ 2 lakkh നു പുറമേ 50000 രൂപ, വരെ അത്രയും പലിശ അടവുണ്ടെങ്കില്‍,  S 80 EE പ്രകാരം ഇളവു ലഭിക്കും\" )","v":""}]
[]
[]
[]
[]
[]
[]
[]
[]
[]
[]
[]
[]
[]
[null,null,null,null,null,null,null,"ANNUAL RENT PAID AND DUE  RS."]
[null,1,null,null,null,null,null,{"$f":"H9","v":0}]
[]
[]
[]
[]
[]
[]
[]
[]
[]
[]
[]
[]
[]
[]
[null,null,null,null,null,null,null,null,null,null,null,null,null,null,null,null,1]
[null,null,null,null,null,null,null,null,null,null,null,null,null,null,null,null,2]
[null,null,null,null,null,null,null,null,null,null,null,null,null,null,null,null,3]
[null,null,null,null,null,null,null,null,null,null,null,null,null,null,null,null,4]
[null,null,null,null,null,null,null,null,null,null,null,null,null,null,null,null,5]
[null,null,null,null,null,null,null,null,null,null,null,null,null,null,null,null,6]
[null,null,null,null,null,null,null,null,null,null,null,null,null,null,null,null,7]
[null,null,null,null,null,null,null,null,null,null,null,null,null,null,null,null,8]
[null,null,null,null,null,null,null,null,null,null,null,null,null,null,null,null,9]
[null,null,null,null,null,null,null,null,null,null,null,null,null,null,null,null,10]
[null,null,null,null,null,null,null,null,null,null,null,null,null,null,null,null,11]
[null,null,null,null,null,null,null,null,null,null,null,null,null,null,null,null,12]
[]
[]
[]
[]
[]
[]
[]
[]
[]
[]
[]
[]
[]
[]
[]
[]
[]
[]
[]
[]
[]
[]
[]
[]
[]
[]
[]
[]
[]
[]
[]
[]
[]
[]
[]
[]
[]
[]
[]
[]
[]
[]
[]
[]
[]
[]
[]
[]
[]
[]
[]
[]
[]
[]
[]
[]
[]
[]
[]
[]
[]
[]
[]
[]
[]
[]
[]
[]
[]
[]
[]
[]
[]
[]
[]
[]
[]
[]
[]
[]
[]
[]
[]
[]
[]
[]
[]
[]
[]
[]
[]
[]
[]
[]
[]
[]
[]
[]
[]
[]
[]
[]
[]
[]
[]
[]
[]
[]
[]
[]
[]
[]
[]
[]
[]
[]
[]
[]
[]
[]
[]
[]
[]
[]
[]
[]
[]
[]
[]
[]
[]
[]
[]
[]
[]
[]
[]
[]
[]
[]
[]
[]
[]
[]
[]
[]
[]
[]
[]
[]
[]
[]
[]
[]
[]
[]
[]
[]
[]
[]
[]
[]
[]
[]
[]
[]
[]
[]
[]
[]
[]
[]
[]
[]
[]
[]
[]
[]
[]
[]
[]
[]
[]
[]
[]
[]
[]
[]
[]
[]
[]
[]
[]
[]
[]
[]
[]
[]
[]
[]
[]
[]
[]
[]
[]
[]
[]
[]
[]
[]
[]
[]
[]
[]
[]
[]
[]
[]
[]
[]
[]
[]
[]
[]
[]
[]
[]
[]
[]
[]
[]
[]
[]
[]
[]
[]
[]
[]
[]
[]
[]
[]
[]
[]
[]
[]
[]
[]
[]
[]
[]
[]
[]
[]
[]
[]
[]
[]
[]
[]
[]
[]
[]
[]
[]
[]
[]
[]
[]
[]
[]
[]
[]
[]
[]
[]
[]
[]
[]
[]
[]
[]
[]
[]
[]
[]
[]
[]
[]
[]
[]
[]
[]
[]
[]
[]
[]
[]
[]
[]
[]
[]
[]
[]
[]
[]
[]
[]
[]
[]
[]
[]
[]
[]
[]
[]
[]
[]
[]
[]
[]
[]
[]
[]
[]
[]
[]
[]
[]
[]
[]
[]
[]
[]
[]
[]
[]
[]
[]
[]
[]
[]
[]
[]
[]
[]
[]
[]
[]
[]
[]
[]
[]
[]
[]
[]
[]
[]
[]
[]
[]
[]
[]
[]
[]
[]
[]
[]
[]
[]
[]
[]
[]
[]
[]
[]
[]
[]
[]
[]
[]
["gg"]

{"sheet":" MONH SPL print","index":11,"n_rows":68,"n_cols":29,"rows_kept":68,"cut":false,"hidden":false,"merged":[[7,28,7,34],[27,27,28,27],[44,27,45,27],[60,1,60,27],[61,11,61,12],[61,25,61,26],[61,13,61,14],[61,15,61,16],[61,17,61,18],[61,19,61,20],[61,21,61,22],[61,23,61,24],[61,1,61,2],[61,3,61,4],[61,5,61,6],[61,7,61,8],[61,9,61,10],[43,1,43,26],[44,1,44,2],[44,3,44,4],[44,5,44,6],[44,7,44,8],[44,9,44,10],[44,11,44,12],[44,13,44,14],[44,15,44,16],[44,17,44,18],[44,19,44,20],[44,21,44,22],[44,23,44,24],[44,25,44,26],[27,15,27,16],[27,17,27,18],[27,19,27,20],[27,21,27,22],[27,23,27,24],[27,25,27,26],[10,23,10,24],[10,25,10,26],[26,1,26,26],[27,1,27,2],[27,3,27,4],[27,5,27,6],[27,7,27,8],[27,9,27,10],[27,11,27,12],[27,13,27,14],[10,11,10,12],[10,13,10,14],[10,15,10,16],[10,17,10,18],[10,19,10,20],[10,21,10,22],[2,19,2,20],[3,19,3,20],[4,19,4,20],[5,4,5,14],[9,1,9,26],[10,1,10,2],[10,3,10,4],[10,5,10,6],[10,7,10,8],[10,9,10,10],[8,1,8,27],[7,1,7,27],[10,27,11,27]]}
[]
[]
[null,null,null,null,{"$f":"\"1. Total of arrears credited to PF [including interest]\"","v":"1. Total of arrears credited to PF [including interest]"},null,null,null,null,null,null,null,null,null,null,null,null,null,null,{"$f":"'ARREAR SPLIT'!N3","v":0}]
[null,null,null,null,"2. Total of arrears as Cash receipt / credited to NPS  [fully or partially] including DEFERRED SALARY & arrear interest",null,null,null,null,null,null,null,null,null,null,null,null,null,null,{"$f":"'ARREAR SPLIT'!N4","v":0}]
[null,null,null,null,{"$f":"\"Total arrears [excluding interest Rs. \"&'det.sal input'!W27&\"] 1+2  minus  Interest\"","v":"Total arrears [excluding interest Rs. ] 1+2  minus  Interest"},null,null,null,null,null,null,null,null,null,null,null,null,null,null,{"$f":"'ARREAR SPLIT'!N5","v":0}]
[null,null,null,null,"Caution : Before filling the following field, place mouse on this lines to read an important message"]
[null,{"$f":"\"Divide the above arrear amount Rs. \"&$T$5&\" in the following tables related with DA arrear, Salary & deferred salary arrear & Pay revision arrear. For that Due drawn statement from SPARK can be used as reference\"","v":"Divide the above arrear amount Rs. 0 in the following tables related with DA arrear, Salary & deferred salary arrear & Pay revision arrear. For that Due drawn statement from SPARK can be used as reference"}]
[null,{"$f":"CUSTOMISE!H22&\" \"&CUSTOMISE!H23","v":" "},null,null,null,null,null,null,null,null,null,null,null,null,null,null,null,null,null,null,null,null,null,null,null,null,null,null,{"$f":"IF('ARR MONH SPLIT'!AD63='det.sal input'!C25+'det.sal input'!C22+'det.sal input'!C21,\"\",\"Caution ! It seems likely that this statement is incorrect, kindly check the monthly split up of arrear with total of arrears received\")","v":""}]
[null,{"$f":"\"Monthly Arrear split up details of \"&PERSONAL!H4&\" for the year ended 31 March 2022\"","v":"Monthly Arrear split up details of  for the year ended 31 March 2022"}]
[null,"1.  DA ARREAR MONTHLY SPLIT UP "]
[null,"2009-10",null,"2010-11",null,"2011-12",null,"2012-13",null,"2013-14",null,"2014-15",null,"2015-16",null,"2016-17",null,"2017-18",null,"2018-19",null,"2019-20",null,"2020-21",null,"2021-22",null,"Total DA arrear"]
[null,"MONTH","ARREAR","MONTH","ARREAR","MONTH","ARREAR","MONTH","ARREAR","MONTH","ARREAR","MONTH","ARREAR","MONTH","ARREAR","MONTH","ARREAR","MONTH","ARREAR","MONTH","ARREAR","MONTH","ARREAR","MONTH","ARREAR","MONTH","ARREAR"]
[null,"MAR",{"$f":"'ARR MONH SPLIT'!C13","v":0},3,{"$f":"'ARR MONH SPLIT'!E13","v":0},3,{"$f":"'ARR MONH SPLIT'!G13","v":0},3,{"$f":"'ARR MONH SPLIT'!I13","v":0},3,{"$f":"'ARR MONH SPLIT'!K13","v":0},3,{"$f":"'ARR MONH SPLIT'!M13","v":0},3,{"$f":"'ARR MONH SPLIT'!O13","v":0},3,{"$f":"'ARR MONH SPLIT'!Q13","v":0},3,{"$f":"'ARR MONH SPLIT'!S13","v":0},3,{"$f":"'ARR MONH SPLIT'!U13","v":0},3,{"$f":"'ARR MONH SPLIT'!W13","v":0},3,{"$f":"'ARR MONH SPLIT'!Y13","v":0},3,{"$f":"'ARR MONH SPLIT'!AA13","v":0}]
[null,"APR",{"$f":"'ARR MONH SPLIT'!C14","v":0},4,{"$f":"'ARR MONH SPLIT'!E14","v":0},4,{"$f":"'ARR MONH SPLIT'!G14","v":0},4,{"$f":"'ARR MONH SPLIT'!I14","v":0},4,{"$f":"'ARR MONH SPLIT'!K14","v":0},4,{"$f":"'ARR MONH SPLIT'!M14","v":0},4,{"$f":"'ARR MONH SPLIT'!O14","v":0},4,{"$f":"'ARR MONH SPLIT'!Q14","v":0},4,{"$f":"'ARR MONH SPLIT'!S14","v":0},4,{"$f":"'ARR MONH SPLIT'!U14","v":0},4,{"$f":"'ARR MONH SPLIT'!W14","v":0},4,{"$f":"'ARR MONH SPLIT'!Y14","v":0},4,{"$f":"'ARR MONH SPLIT'!AA14","v":0}]
[null,"MAY",{"$f":"'ARR MONH SPLIT'!C15","v":0},5,{"$f":"'ARR MONH SPLIT'!E15","v":0},5,{"$f":"'ARR MONH SPLIT'!G15","v":0},5,{"$f":"'ARR MONH SPLIT'!I15","v":0},5,{"$f":"'ARR MONH SPLIT'!K15","v":0},5,{"$f":"'ARR MONH SPLIT'!M15","v":0},5,{"$f":"'ARR MONH SPLIT'!O15","v":0},5,{"$f":"'ARR MONH SPLIT'!Q15","v":0},5,{"$f":"'ARR MONH SPLIT'!S15","v":0},5,{"$f":"'ARR MONH SPLIT'!U15","v":0},5,{"$f":"'ARR MONH SPLIT'!W15","v":0},5,{"$f":"'ARR MONH SPLIT'!Y15","v":0},5,{"$f":"'ARR MONH SPLIT'!AA15","v":0}]
[null,"JUN",{"$f":"'ARR MONH SPLIT'!C16","v":0},6,{"$f":"'ARR MONH SPLIT'!E16","v":0},6,{"$f":"'ARR MONH SPLIT'!G16","v":0},6,{"$f":"'ARR MONH SPLIT'!I16","v":0},6,{"$f":"'ARR MONH SPLIT'!K16","v":0},6,{"$f":"'ARR MONH SPLIT'!M16","v":0},6,{"$f":"'ARR MONH SPLIT'!O16","v":0},6,{"$f":"'ARR MONH SPLIT'!Q16","v":0},6,{"$f":"'ARR MONH SPLIT'!S16","v":0},6,{"$f":"'ARR MONH SPLIT'!U16","v":0},6,{"$f":"'ARR MONH SPLIT'!W16","v":0},6,{"$f":"'ARR MONH SPLIT'!Y16","v":0},6,{"$f":"'ARR MONH SPLIT'!AA16","v":0}]
[null,"JUL",{"$f":"'ARR MONH SPLIT'!C17","v":0},7,{"$f":"'ARR MONH SPLIT'!E17","v":0},7,{"$f":"'ARR MONH SPLIT'!G17","v":0},7,{"$f":"'ARR MONH SPLIT'!I17","v":0},7,{"$f":"'ARR MONH SPLIT'!K17","v":0},7,{"$f":"'ARR MONH SPLIT'!M17","v":0},7,{"$f":"'ARR MONH SPLIT'!O17","v":0},7,{"$f":"'ARR MONH SPLIT'!Q17","v":0},7,{"$f":"'ARR MONH SPLIT'!S17","v":0},7,{"$f":"'ARR MONH SPLIT'!U17","v":0},7,{"$f":"'ARR MONH SPLIT'!W17","v":0},7,{"$f":"'ARR MONH SPLIT'!Y17","v":0},7,{"$f":"'ARR MONH SPLIT'!AA17","v":0}]
[null,"AUG",{"$f":"'ARR MONH SPLIT'!C18","v":0},8,{"$f":"'ARR MONH SPLIT'!E18","v":0},8,{"$f":"'ARR MONH SPLIT'!G18","v":0},8,{"$f":"'ARR MONH SPLIT'!I18","v":0},8,{"$f":"'ARR MONH SPLIT'!K18","v":0},8,{"$f":"'ARR MONH SPLIT'!M18","v":0},8,{"$f":"'ARR MONH SPLIT'!O18","v":0},8,{"$f":"'ARR MONH SPLIT'!Q18","v":0},8,{"$f":"'ARR MONH SPLIT'!S18","v":0},8,{"$f":"'ARR MONH SPLIT'!U18","v":0},8,{"$f":"'ARR MONH SPLIT'!W18","v":0},8,{"$f":"'ARR MONH SPLIT'!Y18","v":0},8,{"$f":"'ARR MONH SPLIT'!AA18","v":0}]
[null,"SEP",{"$f":"'ARR MONH SPLIT'!C19","v":0},9,{"$f":"'ARR MONH SPLIT'!E19","v":0},9,{"$f":"'ARR MONH SPLIT'!G19","v":0},9,{"$f":"'ARR MONH SPLIT'!I19","v":0},9,{"$f":"'ARR MONH SPLIT'!K19","v":0},9,{"$f":"'ARR MONH SPLIT'!M19","v":0},9,{"$f":"'ARR MONH SPLIT'!O19","v":0},9,{"$f":"'ARR MONH SPLIT'!Q19","v":0},9,{"$f":"'ARR MONH SPLIT'!S19","v":0},9,{"$f":"'ARR MONH SPLIT'!U19","v":0},9,{"$f":"'ARR MONH SPLIT'!W19","v":0},9,{"$f":"'ARR MONH SPLIT'!Y19","v":0},9,{"$f":"'ARR MONH SPLIT'!AA19","v":0}]
[null,"OCT",{"$f":"'ARR MONH SPLIT'!C20","v":0},10,{"$f":"'ARR MONH SPLIT'!E20","v":0},10,{"$f":"'ARR MONH SPLIT'!G20","v":0},10,{"$f":"'ARR MONH SPLIT'!I20","v":0},10,{"$f":"'ARR MONH SPLIT'!K20","v":0},10,{"$f":"'ARR MONH SPLIT'!M20","v":0},10,{"$f":"'ARR MONH SPLIT'!O20","v":0},10,{"$f":"'ARR MONH SPLIT'!Q20","v":0},10,{"$f":"'ARR MONH SPLIT'!S20","v":0},10,{"$f":"'ARR MONH SPLIT'!U20","v":0},10,{"$f":"'ARR MONH SPLIT'!W20","v":0},10,{"$f":"'ARR MONH SPLIT'!Y20","v":0},10,{"$f":"'ARR MONH SPLIT'!AA20","v":0}]
[null,"NOV",{"$f":"'ARR MONH SPLIT'!C21","v":0},11,{"$f":"'ARR MONH SPLIT'!E21","v":0},11,{"$f":"'ARR MONH SPLIT'!G21","v":0},11,{"$f":"'ARR MONH SPLIT'!I21","v":0},11,{"$f":"'ARR MONH SPLIT'!K21","v":0},11,{"$f":"'ARR MONH SPLIT'!M21","v":0},11,{"$f":"'ARR MONH SPLIT'!O21","v":0},11,{"$f":"'ARR MONH SPLIT'!Q21","v":0},11,{"$f":"'ARR MONH SPLIT'!S21","v":0},11,{"$f":"'ARR MONH SPLIT'!U21","v":0},11,{"$f":"'ARR MONH SPLIT'!W21","v":0},11,{"$f":"'ARR MONH SPLIT'!Y21","v":0},11,{"$f":"'ARR MONH SPLIT'!AA21","v":0}]
[null,"DEC",{"$f":"'ARR MONH SPLIT'!C22","v":0},12,{"$f":"'ARR MONH SPLIT'!E22","v":0},12,{"$f":"'ARR MONH SPLIT'!G22","v":0},12,{"$f":"'ARR MONH SPLIT'!I22","v":0},12,{"$f":"'ARR MONH SPLIT'!K22","v":0},12,{"$f":"'ARR MONH SPLIT'!M22","v":0},12,{"$f":"'ARR MONH SPLIT'!O22","v":0},12,{"$f":"'ARR MONH SPLIT'!Q22","v":0},12,{"$f":"'ARR MONH SPLIT'!S22","v":0},12,{"$f":"'ARR MONH SPLIT'!U22","v":0},12,{"$f":"'ARR MONH SPLIT'!W22","v":0},12,{"$f":"'ARR MONH SPLIT'!Y22","v":0},12,{"$f":"'ARR MONH SPLIT'!AA22","v":0}]
[null,"JAN",{"$f":"'ARR MONH SPLIT'!C23","v":0},1,{"$f":"'ARR MONH SPLIT'!E23","v":0},1,{"$f":"'ARR MONH SPLIT'!G23","v":0},1,{"$f":"'ARR MONH SPLIT'!I23","v":0},1,{"$f":"'ARR MONH SPLIT'!K23","v":0},1,{"$f":"'ARR MONH SPLIT'!M23","v":0},1,{"$f":"'ARR MONH SPLIT'!O23","v":0},1,{"$f":"'ARR MONH SPLIT'!Q23","v":0},1,{"$f":"'ARR MONH SPLIT'!S23","v":0},1,{"$f":"'ARR MONH SPLIT'!U23","v":0},1,{"$f":"'ARR MONH SPLIT'!W23","v":0},1,{"$f":"'ARR MONH SPLIT'!Y23","v":0},1,{"$f":"'ARR MONH SPLIT'!AA23","v":0}]
[null,"FEB",{"$f":"'ARR MONH SPLIT'!C24","v":0},2,{"$f":"'ARR MONH SPLIT'!E24","v":0},2,{"$f":"'ARR MONH SPLIT'!G24","v":0},2,{"$f":"'ARR MONH SPLIT'!I24","v":0},2,{"$f":"'ARR MONH SPLIT'!K24","v":0},2,{"$f":"'ARR MONH SPLIT'!M24","v":0},2,{"$f":"'ARR MONH SPLIT'!O24","v":0},2,{"$f":"'ARR MONH SPLIT'!Q24","v":0},2,{"$f":"'ARR MONH SPLIT'!S24","v":0},2,{"$f":"'ARR MONH SPLIT'!U24","v":0},2,{"$f":"'ARR MONH SPLIT'!W24","v":0},2,{"$f":"'ARR MONH SPLIT'!Y24","v":0},2,{"$f":"'ARR MONH SPLIT'!AA24","v":0}]
[null,"Total",{"$f":"SUM(C13:C24)","v":0},null,{"$f":"SUM(E13:E24)","v":0},null,{"$f":"SUM(G13:G24)","v":0},null,{"$f":"SUM(I13:I24)","v":0},null,{"$f":"SUM(K13:K24)","v":0},null,{"$f":"SUM(M13:M24)","v":0},null,{"$f":"SUM(O13:O24)","v":0},null,{"$f":"SUM(Q13:Q24)","v":0},null,{"$f":"SUM(S13:S24)","v":0},null,{"$f":"SUM(U13:U24)","v":0},null,{"$f":"SUM(W13:W24)","v":0},null,{"$f":"SUM(Y13:Y24)","v":0},null,{"$f":"SUM(AA13:AA24)","v":0},{"$f":"SUM(C25:AA25)","v":0}]
[null,null,null,null,null,null,null,null,null,null,null,null,null,null,null,null,null,null,null,null,null,null,"2. Deferred salary","Deferred salary ",{"$f":"'ARR MONH SPLIT'!Y26","v":0},null,null,{"$f":"Y26","v":0}]
[null,"3. SALARY ARREAR MONTHLY SPLIT UP "]
[null,"2009-10",null,"2010-11",null,"2011-12",null,"2012-13",null,"2013-14",null,"2014-15",null,"2015-16",null,"2016-17",null,"2017-18",null,"2018-19",null,"2019-20",null,"2020-21",null,"2021-22",null,"Total Salary Arrear"]
[null,"MONTH","ARREAR","MONTH","ARREAR","MONTH","ARREAR","MONTH","ARREAR","MONTH","ARREAR","MONTH","ARREAR","MONTH","ARREAR","MONTH","ARREAR","MONTH","ARREAR","MONTH","ARREAR","MONTH","ARREAR","MONTH","ARREAR","MONTH","ARREAR","Arrear"]
[null,"MAR",{"$f":"'ARR MONH SPLIT'!C30","v":0},3,{"$f":"'ARR MONH SPLIT'!E30","v":0},3,{"$f":"'ARR MONH SPLIT'!G30","v":0},3,{"$f":"'ARR MONH SPLIT'!I30","v":0},3,{"$f":"'ARR MONH SPLIT'!K30","v":0},3,{"$f":"'ARR MONH SPLIT'!M30","v":0},3,{"$f":"'ARR MONH SPLIT'!O30","v":0},3,{"$f":"'ARR MONH SPLIT'!Q30","v":0},3,{"$f":"'ARR MONH SPLIT'!S30","v":0},3,{"$f":"'ARR MONH SPLIT'!U30","v":0},3,{"$f":"'ARR MONH SPLIT'!W30","v":0},3,{"$f":"'ARR MONH SPLIT'!Y30","v":0},3,{"$f":"'ARR MONH SPLIT'!AA30","v":0}]
[null,"APR",{"$f":"'ARR MONH SPLIT'!C31","v":0},4,{"$f":"'ARR MONH SPLIT'!E31","v":0},4,{"$f":"'ARR MONH SPLIT'!G31","v":0},4,{"$f":"'ARR MONH SPLIT'!I31","v":0},4,{"$f":"'ARR MONH SPLIT'!K31","v":0},4,{"$f":"'ARR MONH SPLIT'!M31","v":0},4,{"$f":"'ARR MONH SPLIT'!O31","v":0},4,{"$f":"'ARR MONH SPLIT'!Q31","v":0},4,{"$f":"'ARR MONH SPLIT'!S31","v":0},4,{"$f":"'ARR MONH SPLIT'!U31","v":0},4,{"$f":"'ARR MONH SPLIT'!W31","v":0},4,{"$f":"'ARR MONH SPLIT'!Y31","v":0},4,{"$f":"'ARR MONH SPLIT'!AA31","v":0}]
[null,"MAY",{"$f":"'ARR MONH SPLIT'!C32","v":0},5,{"$f":"'ARR MONH SPLIT'!E32","v":0},5,{"$f":"'ARR MONH SPLIT'!G32","v":0},5,{"$f":"'ARR MONH SPLIT'!I32","v":0},5,{"$f":"'ARR MONH SPLIT'!K32","v":0},5,{"$f":"'ARR MONH SPLIT'!M32","v":0},5,{"$f":"'ARR MONH SPLIT'!O32","v":0},5,{"$f":"'ARR MONH SPLIT'!Q32","v":0},5,{"$f":"'ARR MONH SPLIT'!S32","v":0},5,{"$f":"'ARR MONH SPLIT'!U32","v":0},5,{"$f":"'ARR MONH SPLIT'!W32","v":0},5,{"$f":"'ARR MONH SPLIT'!Y32","v":0},5,{"$f":"'ARR MONH SPLIT'!AA32","v":0}]
[null,"JUN",{"$f":"'ARR MONH SPLIT'!C33","v":0},6,{"$f":"'ARR MONH SPLIT'!E33","v":0},6,{"$f":"'ARR MONH SPLIT'!G33","v":0},6,{"$f":"'ARR MONH SPLIT'!I33","v":0},6,{"$f":"'ARR MONH SPLIT'!K33","v":0},6,{"$f":"'ARR MONH SPLIT'!M33","v":0},6,{"$f":"'ARR MONH SPLIT'!O33","v":0},6,{"$f":"'ARR MONH SPLIT'!Q33","v":0},6,{"$f":"'ARR MONH SPLIT'!S33","v":0},6,{"$f":"'ARR MONH SPLIT'!U33","v":0},6,{"$f":"'ARR MONH SPLIT'!W33","v":0},6,{"$f":"'ARR MONH SPLIT'!Y33","v":0},6,{"$f":"'ARR MONH SPLIT'!AA33","v":0}]
[null,"JUL",{"$f":"'ARR MONH SPLIT'!C34","v":0},7,{"$f":"'ARR MONH SPLIT'!E34","v":0},7,{"$f":"'ARR MONH SPLIT'!G34","v":0},7,{"$f":"'ARR MONH SPLIT'!I34","v":0},7,{"$f":"'ARR MONH SPLIT'!K34","v":0},7,{"$f":"'ARR MONH SPLIT'!M34","v":0},7,{"$f":"'ARR MONH SPLIT'!O34","v":0},7,{"$f":"'ARR MONH SPLIT'!Q34","v":0},7,{"$f":"'ARR MONH SPLIT'!S34","v":0},7,{"$f":"'ARR MONH SPLIT'!U34","v":0},7,{"$f":"'ARR MONH SPLIT'!W34","v":0},7,{"$f":"'ARR MONH SPLIT'!Y34","v":0},7,{"$f":"'ARR MONH SPLIT'!AA34","v":0}]
[null,"AUG",{"$f":"'ARR MONH SPLIT'!C35","v":0},8,{"$f":"'ARR MONH SPLIT'!E35","v":0},8,{"$f":"'ARR MONH SPLIT'!G35","v":0},8,{"$f":"'ARR MONH SPLIT'!I35","v":0},8,{"$f":"'ARR MONH SPLIT'!K35","v":0},8,{"$f":"'ARR MONH SPLIT'!M35","v":0},8,{"$f":"'ARR MONH SPLIT'!O35","v":0},8,{"$f":"'ARR MONH SPLIT'!Q35","v":0},8,{"$f":"'ARR MONH SPLIT'!S35","v":0},8,{"$f":"'ARR MONH SPLIT'!U35","v":0},8,{"$f":"'ARR MONH SPLIT'!W35","v":0},8,{"$f":"'ARR MONH SPLIT'!Y35","v":0},8,{"$f":"'ARR MONH SPLIT'!AA35","v":0}]
[null,"SEP",{"$f":"'ARR MONH SPLIT'!C36","v":0},9,{"$f":"'ARR MONH SPLIT'!E36","v":0},9,{"$f":"'ARR MONH SPLIT'!G36","v":0},9,{"$f":"'ARR MONH SPLIT'!I36","v":0},9,{"$f":"'ARR MONH SPLIT'!K36","v":0},9,{"$f":"'ARR MONH SPLIT'!M36","v":0},9,{"$f":"'ARR MONH SPLIT'!O36","v":0},9,{"$f":"'ARR MONH SPLIT'!Q36","v":0},9,{"$f":"'ARR MONH SPLIT'!S36","v":0},9,{"$f":"'ARR MONH SPLIT'!U36","v":0},9,{"$f":"'ARR MONH SPLIT'!W36","v":0},9,{"$f":"'ARR MONH SPLIT'!Y36","v":0},9,{"$f":"'ARR MONH SPLIT'!AA36","v":0}]
[null,"OCT",{"$f":"'ARR MONH SPLIT'!C37","v":0},10,{"$f":"'ARR MONH SPLIT'!E37","v":0},10,{"$f":"'ARR MONH SPLIT'!G37","v":0},10,{"$f":"'ARR MONH SPLIT'!I37","v":0},10,{"$f":"'ARR MONH SPLIT'!K37","v":0},10,{"$f":"'ARR MONH SPLIT'!M37","v":0},10,{"$f":"'ARR MONH SPLIT'!O37","v":0},10,{"$f":"'ARR MONH SPLIT'!Q37","v":0},10,{"$f":"'ARR MONH SPLIT'!S37","v":0},10,{"$f":"'ARR MONH SPLIT'!U37","v":0},10,{"$f":"'ARR MONH SPLIT'!W37","v":0},10,{"$f":"'ARR MONH SPLIT'!Y37","v":0},10,{"$f":"'ARR MONH SPLIT'!AA37","v":0}]
[null,"NOV",{"$f":"'ARR MONH SPLIT'!C38","v":0},11,{"$f":"'ARR MONH SPLIT'!E38","v":0},11,{"$f":"'ARR MONH SPLIT'!G38","v":0},11,{"$f":"'ARR MONH SPLIT'!I38","v":0},11,{"$f":"'ARR MONH SPLIT'!K38","v":0},11,{"$f":"'ARR MONH SPLIT'!M38","v":0},11,{"$f":"'ARR MONH SPLIT'!O38","v":0},11,{"$f":"'ARR MONH SPLIT'!Q38","v":0},11,{"$f":"'ARR MONH SPLIT'!S38","v":0},11,{"$f":"'ARR MONH SPLIT'!U38","v":0},11,{"$f":"'ARR MONH SPLIT'!W38","v":0},11,{"$f":"'ARR MONH SPLIT'!Y38","v":0},11,{"$f":"'ARR MONH SPLIT'!AA38","v":0}]
[null,"DEC",{"$f":"'ARR MONH SPLIT'!C39","v":0},12,{"$f":"'ARR MONH SPLIT'!E39","v":0},12,{"$f":"'ARR MONH SPLIT'!G39","v":0},12,{"$f":"'ARR MONH SPLIT'!I39","v":0},12,{"$f":"'ARR MONH SPLIT'!K39","v":0},12,{"$f":"'ARR MONH SPLIT'!M39","v":0},12,{"$f":"'ARR MONH SPLIT'!O39","v":0},12,{"$f":"'ARR MONH SPLIT'!Q39","v":0},12,{"$f":"'ARR MONH SPLIT'!S39","v":0},12,{"$f":"'ARR MONH SPLIT'!U39","v":0},12,{"$f":"'ARR MONH SPLIT'!W39","v":0},12,{"$f":"'ARR MONH SPLIT'!Y39","v":0},12,{"$f":"'ARR MONH SPLIT'!AA39","v":0}]
[null,"JAN",{"$f":"'ARR MONH SPLIT'!C40","v":0},1,{"$f":"'ARR MONH SPLIT'!E40","v":0},1,{"$f":"'ARR MONH SPLIT'!G40","v":0},1,{"$f":"'ARR MONH SPLIT'!I40","v":0},1,{"$f":"'ARR MONH SPLIT'!K40","v":0},1,{"$f":"'ARR MONH SPLIT'!M40","v":0},1,{"$f":"'ARR MONH SPLIT'!O40","v":0},1,{"$f":"'ARR MONH SPLIT'!Q40","v":0},1,{"$f":"'ARR MONH SPLIT'!S40","v":0},1,{"$f":"'ARR MONH SPLIT'!U40","v":0},1,{"$f":"'ARR MONH SPLIT'!W40","v":0},1,{"$f":"'ARR MONH SPLIT'!Y40","v":0},1,{"$f":"'ARR MONH SPLIT'!AA40","v":0}]
[null,"FEB",{"$f":"'ARR MONH SPLIT'!C41","v":0},2,{"$f":"'ARR MONH SPLIT'!E41","v":0},2,{"$f":"'ARR MONH SPLIT'!G41","v":0},2,{"$f":"'ARR MONH SPLIT'!I41","v":0},2,{"$f":"'ARR MONH SPLIT'!K41","v":0},2,{"$f":"'ARR MONH SPLIT'!M41","v":0},2,{"$f":"'ARR MONH SPLIT'!O41","v":0},2,{"$f":"'ARR MONH SPLIT'!Q41","v":0},2,{"$f":"'ARR MONH SPLIT'!S41","v":0},2,{"$f":"'ARR MONH SPLIT'!U41","v":0},2,{"$f":"'ARR MONH SPLIT'!W41","v":0},2,{"$f":"'ARR MONH SPLIT'!Y41","v":0},2,{"$f":"'ARR MONH SPLIT'!AA41","v":0}]
[null,"Total",{"$f":"SUM(C30:C41)","v":0},null,{"$f":"SUM(E30:E41)","v":0},null,{"$f":"SUM(G30:G41)","v":0},null,{"$f":"SUM(I30:I41)","v":0},null,{"$f":"SUM(K30:K41)","v":0},null,{"$f":"SUM(M30:M41)","v":0},null,{"$f":"SUM(O30:O41)","v":0},null,{"$f":"SUM(Q30:Q41)","v":0},null,{"$f":"SUM(S30:S41)","v":0},null,{"$f":"SUM(U30:U41)","v":0},null,{"$f":"SUM(W30:W41)","v":0},null,{"$f":"SUM(Y30:Y41)","v":0},null,{"$f":"SUM(AA30:AA41)","v":0},{"$f":"SUM(C42:AA42)","v":0}]
[]
[null,{"$f":"\"4. PAY REVISION ARREAR or any other arrear  MONTHLY SPLIT UP OF \"&PERSONAL!H4","v":"4. PAY REVISION ARREAR or any other arrear  MONTHLY SPLIT UP OF "}]
[null,"2009-10",null,"2010-11",null,"2011-12",null,"2012-13",null,"2013-14",null,"2014-15",null,"2015-16",null,"2016-17",null,"2017-18",null,"2018-19",null,"2019-20",null,"2020-21",null,"2021-22",null,"Total Pay revision arrear"]
[null,"MONTH","ARREAR","MONTH","ARREAR","MONTH","ARREAR","MONTH","ARREAR","MONTH","ARREAR","MONTH","ARREAR","MONTH","ARREAR","MONTH","ARREAR","MONTH","ARREAR","MONTH","ARREAR","MONTH","ARREAR","MONTH","ARREAR","MONTH","ARREAR","Arrear"]
[null,"MAR",{"$f":"'ARR MONH SPLIT'!C47","v":0},3,{"$f":"'ARR MONH SPLIT'!E47","v":0},3,{"$f":"'ARR MONH SPLIT'!G47","v":0},3,{"$f":"'ARR MONH SPLIT'!I47","v":0},3,{"$f":"'ARR MONH SPLIT'!K47","v":0},3,{"$f":"'ARR MONH SPLIT'!M47","v":0},3,{"$f":"'ARR MONH SPLIT'!O47","v":0},3,{"$f":"'ARR MONH SPLIT'!Q47","v":0},3,{"$f":"'ARR MONH SPLIT'!S47","v":0},3,{"$f":"'ARR MONH SPLIT'!U47","v":0},3,{"$f":"'ARR MONH SPLIT'!W47","v":0},3,{"$f":"'ARR MONH SPLIT'!Y47","v":0},3,{"$f":"'ARR MONH SPLIT'!AA47","v":0}]
[null,"APR",{"$f":"'ARR MONH SPLIT'!C48","v":0},4,{"$f":"'ARR MONH SPLIT'!E48","v":0},4,{"$f":"'ARR MONH SPLIT'!G48","v":0},4,{"$f":"'ARR MONH SPLIT'!I48","v":0},4,{"$f":"'ARR MONH SPLIT'!K48","v":0},4,{"$f":"'ARR MONH SPLIT'!M48","v":0},4,{"$f":"'ARR MONH SPLIT'!O48","v":0},4,{"$f":"'ARR MONH SPLIT'!Q48","v":0},4,{"$f":"'ARR MONH SPLIT'!S48","v":0},4,{"$f":"'ARR MONH SPLIT'!U48","v":0},4,{"$f":"'ARR MONH SPLIT'!W48","v":0},4,{"$f":"'ARR MONH SPLIT'!Y48","v":0},4,{"$f":"'ARR MONH SPLIT'!AA48","v":0}]
[null,"MAY",{"$f":"'ARR MONH SPLIT'!C49","v":0},5,{"$f":"'ARR MONH SPLIT'!E49","v":0},5,{"$f":"'ARR MONH SPLIT'!G49","v":0},5,{"$f":"'ARR MONH SPLIT'!I49","v":0},5,{"$f":"'ARR MONH SPLIT'!K49","v":0},5,{"$f":"'ARR MONH SPLIT'!M49","v":0},5,{"$f":"'ARR MONH SPLIT'!O49","v":0},5,{"$f":"'ARR MONH SPLIT'!Q49","v":0},5,{"$f":"'ARR MONH SPLIT'!S49","v":0},5,{"$f":"'ARR MONH SPLIT'!U49","v":0},5,{"$f":"'ARR MONH SPLIT'!W49","v":0},5,{"$f":"'ARR MONH SPLIT'!Y49","v":0},5,{"$f":"'ARR MONH SPLIT'!AA49","v":0}]
[null,"JUN",{"$f":"'ARR MONH SPLIT'!C50","v":0},6,{"$f":"'ARR MONH SPLIT'!E50","v":0},6,{"$f":"'ARR MONH SPLIT'!G50","v":0},6,{"$f":"'ARR MONH SPLIT'!I50","v":0},6,{"$f":"'ARR MONH SPLIT'!K50","v":0},6,{"$f":"'ARR MONH SPLIT'!M50","v":0},6,{"$f":"'ARR MONH SPLIT'!O50","v":0},6,{"$f":"'ARR MONH SPLIT'!Q50","v":0},6,{"$f":"'ARR MONH SPLIT'!S50","v":0},6,{"$f":"'ARR MONH SPLIT'!U50","v":0},6,{"$f":"'ARR MONH SPLIT'!W50","v":0},6,{"$f":"'ARR MONH SPLIT'!Y50","v":0},6,{"$f":"'ARR MONH SPLIT'!AA50","v":0}]
[null,"JUL",{"$f":"'ARR MONH SPLIT'!C51","v":0},7,{"$f":"'ARR MONH SPLIT'!E51","v":0},7,{"$f":"'ARR MONH SPLIT'!G51","v":0},7,{"$f":"'ARR MONH SPLIT'!I51","v":0},7,{"$f":"'ARR MONH SPLIT'!K51","v":0},7,{"$f":"'ARR MONH SPLIT'!M51","v":0},7,{"$f":"'ARR MONH SPLIT'!O51","v":0},7,{"$f":"'ARR MONH SPLIT'!Q51","v":0},7,{"$f":"'ARR MONH SPLIT'!S51","v":0},7,{"$f":"'ARR MONH SPLIT'!U51","v":0},7,{"$f":"'ARR MONH SPLIT'!W51","v":0},7,{"$f":"'ARR MONH SPLIT'!Y51","v":0},7,{"$f":"'ARR MONH SPLIT'!AA51","v":0}]
[null,"AUG",{"$f":"'ARR MONH SPLIT'!C52","v":0},8,{"$f":"'ARR MONH SPLIT'!E52","v":0},8,{"$f":"'ARR MONH SPLIT'!G52","v":0},8,{"$f":"'ARR MONH SPLIT'!I52","v":0},8,{"$f":"'ARR MONH SPLIT'!K52","v":0},8,{"$f":"'ARR MONH SPLIT'!M52","v":0},8,{"$f":"'ARR MONH SPLIT'!O52","v":0},8,{"$f":"'ARR MONH SPLIT'!Q52","v":0},8,{"$f":"'ARR MONH SPLIT'!S52","v":0},8,{"$f":"'ARR MONH SPLIT'!U52","v":0},8,{"$f":"'ARR MONH SPLIT'!W52","v":0},8,{"$f":"'ARR MONH SPLIT'!Y52","v":0},8,{"$f":"'ARR MONH SPLIT'!AA52","v":0}]
[null,"SEP",{"$f":"'ARR MONH SPLIT'!C53","v":0},9,{"$f":"'ARR MONH SPLIT'!E53","v":0},9,{"$f":"'ARR MONH SPLIT'!G53","v":0},9,{"$f":"'ARR MONH SPLIT'!I53","v":0},9,{"$f":"'ARR MONH SPLIT'!K53","v":0},9,{"$f":"'ARR MONH SPLIT'!M53","v":0},9,{"$f":"'ARR MONH SPLIT'!O53","v":0},9,{"$f":"'ARR MONH SPLIT'!Q53","v":0},9,{"$f":"'ARR MONH SPLIT'!S53","v":0},9,{"$f":"'ARR MONH SPLIT'!U53","v":0},9,{"$f":"'ARR MONH SPLIT'!W53","v":0},9,{"$f":"'ARR MONH SPLIT'!Y53","v":0},9,{"$f":"'ARR MONH SPLIT'!AA53","v":0}]
[null,"OCT",{"$f":"'ARR MONH SPLIT'!C54","v":0},10,{"$f":"'ARR MONH SPLIT'!E54","v":0},10,{"$f":"'ARR MONH SPLIT'!G54","v":0},10,{"$f":"'ARR MONH SPLIT'!I54","v":0},10,{"$f":"'ARR MONH SPLIT'!K54","v":0},10,{"$f":"'ARR MONH SPLIT'!M54","v":0},10,{"$f":"'ARR MONH SPLIT'!O54","v":0},10,{"$f":"'ARR MONH SPLIT'!Q54","v":0},10,{"$f":"'ARR MONH SPLIT'!S54","v":0},10,{"$f":"'ARR MONH SPLIT'!U54","v":0},10,{"$f":"'ARR MONH SPLIT'!W54","v":0},10,{"$f":"'ARR MONH SPLIT'!Y54","v":0},10,{"$f":"'ARR MONH SPLIT'!AA54","v":0}]
[null,"NOV",{"$f":"'ARR MONH SPLIT'!C55","v":0},11,{"$f":"'ARR MONH SPLIT'!E55","v":0},11,{"$f":"'ARR MONH SPLIT'!G55","v":0},11,{"$f":"'ARR MONH SPLIT'!I55","v":0},11,{"$f":"'ARR MONH SPLIT'!K55","v":0},11,{"$f":"'ARR MONH SPLIT'!M55","v":0},11,{"$f":"'ARR MONH SPLIT'!O55","v":0},11,{"$f":"'ARR MONH SPLIT'!Q55","v":0},11,{"$f":"'ARR MONH SPLIT'!S55","v":0},11,{"$f":"'ARR MONH SPLIT'!U55","v":0},11,{"$f":"'ARR MONH SPLIT'!W55","v":0},11,{"$f":"'ARR MONH SPLIT'!Y55","v":0},11,{"$f":"'ARR MONH SPLIT'!AA55","v":0}]
[null,"DEC",{"$f":"'ARR MONH SPLIT'!C56","v":0},12,{"$f":"'ARR MONH SPLIT'!E56","v":0},12,{"$f":"'ARR MONH SPLIT'!G56","v":0},12,{"$f":"'ARR MONH SPLIT'!I56","v":0},12,{"$f":"'ARR MONH SPLIT'!K56","v":0},12,{"$f":"'ARR MONH SPLIT'!M56","v":0},12,{"$f":"'ARR MONH SPLIT'!O56","v":0},12,{"$f":"'ARR MONH SPLIT'!Q56","v":0},12,{"$f":"'ARR MONH SPLIT'!S56","v":0},12,{"$f":"'ARR MONH SPLIT'!U56","v":0},12,{"$f":"'ARR MONH SPLIT'!W56","v":0},12,{"$f":"'ARR MONH SPLIT'!Y56","v":0},12,{"$f":"'ARR MONH SPLIT'!AA56","v":0}]
[null,"JAN",{"$f":"'ARR MONH SPLIT'!C57","v":0},1,{"$f":"'ARR MONH SPLIT'!E57","v":0},1,{"$f":"'ARR MONH SPLIT'!G57","v":0},1,{"$f":"'ARR MONH SPLIT'!I57","v":0},1,{"$f":"'ARR MONH SPLIT'!K57","v":0},1,{"$f":"'ARR MONH SPLIT'!M57","v":0},1,{"$f":"'ARR MONH SPLIT'!O57","v":0},1,{"$f":"'ARR MONH SPLIT'!Q57","v":0},1,{"$f":"'ARR MONH SPLIT'!S57","v":0},1,{"$f":"'ARR MONH SPLIT'!U57","v":0},1,{"$f":"'ARR MONH SPLIT'!W57","v":0},1,{"$f":"'ARR MONH SPLIT'!Y57","v":0},1,{"$f":"'ARR MONH SPLIT'!AA57","v":0}]
[null,"FEB",{"$f":"'ARR MONH SPLIT'!C58","v":0},2,{"$f":"'ARR MONH SPLIT'!E58","v":0},2,{"$f":"'ARR MONH SPLIT'!G58","v":0},2,{"$f":"'ARR MONH SPLIT'!I58","v":0},2,{"$f":"'ARR MONH SPLIT'!K58","v":0},2,{"$f":"'ARR MONH SPLIT'!M58","v":0},2,{"$f":"'ARR MONH SPLIT'!O58","v":0},2,{"$f":"'ARR MONH SPLIT'!Q58","v":0},2,{"$f":"'ARR MONH SPLIT'!S58","v":0},2,{"$f":"'ARR MONH SPLIT'!U58","v":0},2,{"$f":"'ARR MONH SPLIT'!W58","v":0},2,{"$f":"'ARR MONH SPLIT'!Y58","v":0},2,{"$f":"'ARR MONH SPLIT'!AA58","v":0}]
[null,"Total",{"$f":"SUM(C47:C58)","v":0},null,{"$f":"SUM(E47:E58)","v":0},null,{"$f":"SUM(G47:G58)","v":0},null,{"$f":"SUM(I47:I58)","v":0},null,{"$f":"SUM(K47:K58)","v":0},null,{"$f":"SUM(M47:M58)","v":0},null,{"$f":"SUM(O47:O58)","v":0},null,{"$f":"SUM(Q47:Q58)","v":0},null,{"$f":"SUM(S47:S58)","v":0},null,{"$f":"SUM(U47:U58)","v":0},null,{"$f":"SUM(W47:W58)","v":0},null,{"$f":"SUM(Y47:Y58)","v":0},null,{"$f":"SUM(AA47:AA58)","v":0},{"$f":"SUM(C59:AA59)","v":0}]
[]
[null,"Annual split up of Total arrears inculded in salary including DA, Salary, Pay revision, Deferred salary and other arrears"]
[null,"Total 2009-10",null,"Total 2010-11",null,"Total 2011-12",null,"Total 2012-13",null,"Total 2013-14",null,"Total 2014-15",null,"Total 2015-16",null,"Total 2016-17",null,"Total 2017-18",null,"Total 2018-19",null,"Total 2019-20",null,"Total 2020-21",null,"Total 2021-22",null,"Grant Total"]
[null,"Amount Rs",{"$f":"C59+C42+C25","v":0},null,{"$f":"E59+E42+E25","v":0},null,{"$f":"G59+G42+G25","v":0},null,{"$f":"I59+I42+I25","v":0},null,{"$f":"K59+K42+K25","v":0},null,{"$f":"M59+M42+M25","v":0},null,{"$f":"O59+O42+O25","v":0},null,{"$f":"Q59+Q42+Q25","v":0},null,{"$f":"S59+S42+S25","v":0},null,{"$f":"U59+U42+U25","v":0},null,{"$f":"W59+W42+W25","v":0},null,{"$f":"Y59+Y42+Y25+Y26","v":0},null,{"$f":"AA59+AA42+AA25","v":0},{"$f":"SUM(C63:AA63)","v":0},{"$f":"T5-AB63","v":0}]
[]
[]
[]
[]
[null,null,null,null,null,null,null,null,null,null,null,null,null,null,null,null,null,null,null,null,null,null,null,null,null,{"$f":"IF(AA68<1,\"Error ! Arrear splitted to different years should not be more than arrears received\",IF(AA66=AA67,\"\",IF(AB63=0,\"\",IF(AB63>0,\"Balance arrear amount, still pending to apportion is Rs. \"))))","v":""},{"$f":"IF(AA66=AA67,\"\",IF($AA$66=\"\",\"\",AC63))","v":""}]

{"sheet":"ARR MONH SPLIT","index":12,"n_rows":107,"n_cols":31,"rows_kept":107,"cut":false,"hidden":false,"merged":[[106,8,106,10],[67,11,67,25],[61,21,61,22],[61,23,61,24],[61,25,61,26],[61,11,61,12],[61,13,61,14],[61,15,61,16],[61,17,61,18],[61,19,61,20],[27,1,27,2],[61,1,61,2],[61,3,61,4],[61,5,61,6],[61,7,61,8],[44,1,44,2],[44,3,44,4],[44,5,44,6],[44,7,44,8],[27,3,27,4],[27,5,27,6],[27,7,27,8],[2,19,2,20],[3,19,3,20],[4,19,4,20],[27,27,27,28],[44,27,44,28],[27,21,27,22],[27,23,27,24],[27,19,27,20],[43,1,43,26],[10,1,10,2],[10,11,10,12],[10,3,10,4],[10,23,10,24],[10,17,10,18],[10,15,10,16],[10,5,10,6],[5,4,5,20],[27,25,27,26],[44,21,44,22],[44,23,44,24],[44,25,44,26],[44,11,44,12],[44,13,44,14],[44,15,44,16],[44,17,44,18],[44,19,44,20],[9,1,9,26],[26,1,26,26],[27,17,27,18],[10,19,10,20],[10,13,10,14],[10,21,10,22],[10,7,10,8],[10,27,10,28],[27,9,27,10],[27,11,27,12],[61,27,61,28],[10,9,10,10],[10,25,10,26],[27,13,27,14],[27,15,27,16],[61,9,61,10],[44,9,44,10]]}
[]
[]
[null,null,null,null,{"$f":"\"1. Total of arrears credited to PF [including interest]\"","v":"1. Total of arrears credited to PF [including interest]"},null,null,null,null,null,null,null,null,null,null,null,null,null,null,{"$f":"'ARREAR SPLIT'!N3","v":0}]
[null,null,null,null,"2. Total of arrears as Cash receipt / credited to NPS  [fully or partially] including DEFERRED SALARY & arrear interest",null,null,null,null,null,null,null,null,null,null,null,null,null,null,{"$f":"'ARREAR SPLIT'!N4","v":0},null,{"$f":"\"(Deferred salary is \"&'det.sal input'!C25&\", Cash arrear is \"&'det.sal input'!C22&\")\"","v":"(Deferred salary is , Cash arrear is )"}]
[null,null,null,null,{"$f":"\"Total arrears [excluding interest Rs. \"&'det.sal input'!W27&\"] 1+2  minus  Interest\"","v":"Total arrears [excluding interest Rs. ] 1+2  minus  Interest"},null,null,null,null,null,null,null,null,null,null,null,null,null,null,{"$f":"'ARREAR SPLIT'!N5","v":0}]
[null,null,null,null,"Caution : Before filling the following field, place mouse on this lines to read an important message"]
[null,{"$f":"\"Divide the above arrear amount Rs. \"&$T$5&\" in the following tables related with DA arrear, Salary & deferred salary arrear & Pay revision arrear. For that Due drawn statement from SPARK can be used as reference\"","v":"Divide the above arrear amount Rs. 0 in the following tables related with DA arrear, Salary & deferred salary arrear & Pay revision arrear. For that Due drawn statement from SPARK can be used as reference"}]
[null,"മുകളിൽ കാണുന്ന മൊത്തം കുടിശിക തുകയെ, ചുവടെ കാണുന്ന മൂന്നോ നാലോ പട്ടികകളിൽ  മാസം തിരിച്ചു ഭാഗിച്ച് എഴുതുക. Deferred salary രണ്ടാം പട്ടികയിൽ നൽകുക "]
[]
[null,{"$f":"\"1. DA ARREAR MONTHLY SPLIT UP OF \"&PERSONAL!H4","v":"1. DA ARREAR MONTHLY SPLIT UP OF "}]
[null,"2009-10",null,"2010-11",null,"2011-12",null,"2012-13",null,"2013-14",null,"2014-15",null,"2015-16",null,"2016-17",null,"2017-18",null,"2018-19",null,"2019-20",null,"2020-21",null,"2021-22",null,"2022-23",null,"Total "]
[null,"MONTH","ARREAR","MONTH","ARREAR","MONTH","ARREAR","MONTH","ARREAR","MONTH","ARREAR","MONTH","ARREAR","MONTH","ARREAR","MONTH","ARREAR","MONTH","ARREAR","MONTH","ARREAR","MONTH","ARREAR","MONTH","ARREAR","MONTH","ARREAR","MONTH","ARREAR","Arrear"]
[null,"MAR",null,3,null,3,null,3,null,3,null,3,null,3,null,3,null,3,null,3,null,3,null,3,null,3,null,3]
[null,"APR",null,4,null,4,null,4,null,4,null,4,null,4,null,4,null,4,null,4,null,4,null,4,null,4,null,4]
[null,"MAY",null,5,null,5,null,5,null,5,null,5,null,5,null,5,null,5,null,5,null,5,null,5,null,5,null,5]
[null,"JUN",null,6,null,6,null,6,null,6,null,6,null,6,null,6,null,6,null,6,null,6,null,6,null,6,null,6]
[null,"JUL",null,7,null,7,null,7,null,7,null,7,null,7,null,7,null,7,null,7,null,7,null,7,null,7,null,7]
[null,"AUG",null,8,null,8,null,8,null,8,null,8,null,8,null,8,null,8,null,8,null,8,null,8,null,8,null,8]
[null,"SEP",null,9,null,9,null,9,null,9,null,9,null,9,null,9,null,9,null,9,null,9,null,9,null,9,null,9]
[null,"OCT",null,10,null,10,null,10,null,10,null,10,null,10,null,10,null,10,null,10,null,10,null,10,null,10,null,10]
[null,"NOV",null,11,null,11,null,11,null,11,null,11,null,11,null,11,null,11,null,11,null,11,null,11,null,11,null,11]
[null,"DEC",null,12,null,12,null,12,null,12,null,12,null,12,null,12,null,12,null,12,null,12,null,12,null,12,null,12]
[null,"JAN",null,1,null,1,null,1,null,1,null,1,null,1,null,1,null,1,null,1,null,1,null,1,null,1]
[null,"FEB",null,2,null,2,null,2,null,2,null,2,null,2,null,2,null,2,null,2,null,2,null,2,null,2,null,2]
[null,"Total",{"$f":"SUM(C13:C24)","v":0},null,{"$f":"SUM(E13:E24)","v":0},null,{"$f":"SUM(G13:G24)","v":0},null,{"$f":"SUM(I13:I24)","v":0},null,{"$f":"SUM(K13:K24)","v":0},null,{"$f":"SUM(M13:M24)","v":0},null,{"$f":"SUM(O13:O24)","v":0},null,{"$f":"SUM(Q13:Q24)","v":0},null,{"$f":"SUM(S13:S24)","v":0},null,{"$f":"SUM(U13:U24)","v":0},null,{"$f":"SUM(W13:W24)","v":0},null,{"$f":"SUM(Y13:Y24)","v":0},null,{"$f":"SUM(AA13:AA24)","v":0},null,{"$f":"SUM(AC13:AC24)","v":0},{"$f":"SUM(C25:AC25)","v":0}]
[null,null,null,null,null,null,null,null,null,null,null,null,null,null,null,null,null,null,null,null,null,null,null,{"$f":"\"2. DEFERRED SALARY to be included in 2020-21 Financial year column (Deferred salary തുകയായ \"&'det.sal input'!C25&\" രൂപ വലതുവശത്ത് ടയിപ്പ് ചെയ്യുക)\"","v":"2. DEFERRED SALARY to be included in 2020-21 Financial year column (Deferred salary തുകയായ  രൂപ വലതുവശത്ത് ടയിപ്പ് ചെയ്യുക)"},null,null,null,null,null,{"$f":"Y26","v":0}]
[null,"3. SALARY ARREAR MONTHLY SPLIT UP "]
[null,"2009-10",null,"2010-11",null,"2011-12",null,"2012-13",null,"2013-14",null,"2014-15",null,"2015-16",null,"2016-17",null,"2017-18",null,"2018-19",null,"2019-20",null,"2020-21",null,"2021-22",null,"2022-23",null,"Total "]
[null,"MONTH","ARREAR","MONTH","ARREAR","MONTH","ARREAR","MONTH","ARREAR","MONTH","ARREAR","MONTH","ARREAR","MONTH","ARREAR","MONTH","ARREAR","MONTH","ARREAR","MONTH","ARREAR","MONTH","ARREAR","MONTH","ARREAR","MONTH","ARREAR","MONTH","ARREAR","Arrear"]
[null,"MAR",null,3,null,3,null,3,null,3,null,3,null,3,null,3,null,3,null,3,null,3,null,3,null,3,null,3]
[null,"APR",null,4,null,4,null,4,null,4,null,4,null,4,null,4,null,4,null,4,null,4,null,4,null,4,null,4]
[null,"MAY",null,5,null,5,null,5,null,5,null,5,null,5,null,5,null,5,null,5,null,5,null,5,null,5,null,5]
[null,"JUN",null,6,null,6,null,6,null,6,null,6,null,6,null,6,null,6,null,6,null,6,null,6,null,6,null,6]
[null,"JUL",null,7,null,7,null,7,null,7,null,7,null,7,null,7,null,7,null,7,null,7,null,7,null,7,null,7]
[null,"AUG",null,8,null,8,null,8,null,8,null,8,null,8,null,8,null,8,null,8,null,8,null,8,null,8,null,8]
[null,"SEP",null,9,null,9,null,9,null,9,null,9,null,9,null,9,null,9,null,9,null,9,null,9,null,9,null,9]
[null,"OCT",null,10,null,10,null,10,null,10,null,10,null,10,null,10,null,10,null,10,null,10,null,10,null,10,null,10]
[null,"NOV",null,11,null,11,null,11,null,11,null,11,null,11,null,11,null,11,null,11,null,11,null,11,null,11,null,11]
[null,"DEC",null,12,null,12,null,12,null,12,null,12,null,12,null,12,null,12,null,12,null,12,null,12,null,12,null,12]
[null,"JAN",null,1,null,1,null,1,null,1,null,1,null,1,null,1,null,1,null,1,null,1,null,1,null,1]
[null,"FEB",null,2,null,2,null,2,null,2,null,2,null,2,null,2,null,2,null,2,null,2,null,2,null,2,null,2]
[null,"Total",{"$f":"SUM(C30:C41)","v":0},null,{"$f":"SUM(E30:E41)","v":0},null,{"$f":"SUM(G30:G41)","v":0},null,{"$f":"SUM(I30:I41)","v":0},null,{"$f":"SUM(K30:K41)","v":0},null,{"$f":"SUM(M30:M41)","v":0},null,{"$f":"SUM(O30:O41)","v":0},null,{"$f":"SUM(Q30:Q41)","v":0},null,{"$f":"SUM(S30:S41)","v":0},null,{"$f":"SUM(U30:U41)","v":0},null,{"$f":"SUM(W30:W41)","v":0},null,{"$f":"SUM(Y30:Y41)","v":0},null,{"$f":"SUM(AA30:AA41)","v":0},null,{"$f":"SUM(AC30:AC41)","v":0},{"$f":"SUM(C42:AC42)","v":0}]
[]
[null,{"$f":"\"4. PAY REVISION ARREAR or any other arrear  MONTHLY SPLIT UP OF \"&PERSONAL!H4","v":"4. PAY REVISION ARREAR or any other arrear  MONTHLY SPLIT UP OF "}]
[null,"2009-10",null,"2010-11",null,"2011-12",null,"2012-13",null,"2013-14",null,"2014-15",null,"2015-16",null,"2016-17",null,"2017-18",null,"2018-19",null,"2019-20",null,"2020-21",null,"2021-22",null,"2022-23",null,"Total "]
[null,"MONTH","ARREAR","MONTH","ARREAR","MONTH","ARREAR","MONTH","ARREAR","MONTH","ARREAR","MONTH","ARREAR","MONTH","ARREAR","MONTH","ARREAR","MONTH","ARREAR","MONTH","ARREAR","MONTH","ARREAR","MONTH","ARREAR","MONTH","ARREAR","MONTH","ARREAR","Arrear"]
[null,"MAR",null,3,null,3,null,3,null,3,null,3,null,3,null,3,null,3,null,3,null,3,null,3,null,3,null,3]
[null,"APR",null,4,null,4,null,4,null,4,null,4,null,4,null,4,null,4,null,4,null,4,null,4,null,4,null,4]
[null,"MAY",null,5,null,5,null,5,null,5,null,5,null,5,null,5,null,5,null,5,null,5,null,5,null,5,null,5]
[null,"JUN",null,6,null,6,null,6,null,6,null,6,null,6,null,6,null,6,null,6,null,6,null,6,null,6,null,6]
[null,"JUL",null,7,null,7,null,7,null,7,null,7,null,7,null,7,null,7,null,7,null,7,null,7,null,7,null,7]
[null,"AUG",null,8,null,8,null,8,null,8,null,8,null,8,null,8,null,8,null,8,null,8,null,8,null,8,null,8]
[null,"SEP",null,9,null,9,null,9,null,9,null,9,null,9,null,9,null,9,null,9,null,9,null,9,null,9,null,9]
[null,"OCT",null,10,null,10,null,10,null,10,null,10,null,10,null,10,null,10,null,10,null,10,null,10,null,10,null,10]
[null,"NOV",null,11,null,11,null,11,null,11,null,11,null,11,null,11,null,11,null,11,null,11,null,11,null,11,null,11]
[null,"DEC",null,12,null,12,null,12,null,12,null,12,null,12,null,12,null,12,null,12,null,12,null,12,null,12,null,12]
[null,"JAN",null,1,null,1,null,1,null,1,null,1,null,1,null,1,null,1,null,1,null,1,null,1,null,1]
[null,"FEB",null,2,null,2,null,2,null,2,null,2,null,2,null,2,null,2,null,2,null,2,null,2,null,2,null,2]
[null,"Total",{"$f":"SUM(C47:C58)","v":0},null,{"$f":"SUM(E47:E58)","v":0},null,{"$f":"SUM(G47:G58)","v":0},null,{"$f":"SUM(I47:I58)","v":0},null,{"$f":"SUM(K47:K58)","v":0},null,{"$f":"SUM(M47:M58)","v":0},null,{"$f":"SUM(O47:O58)","v":0},null,{"$f":"SUM(Q47:Q58)","v":0},null,{"$f":"SUM(S47:S58)","v":0},null,{"$f":"SUM(U47:U58)","v":0},null,{"$f":"SUM(W47:W58)","v":0},null,{"$f":"SUM(Y47:Y58)","v":0},null,{"$f":"SUM(AA47:AA58)","v":0},null,{"$f":"SUM(AC47:AC58)","v":0},{"$f":"SUM(C59:AC59)","v":0}]
[]
[]
[null,"Total 2009-10",null,"Total 2010-11",null,"Total 2011-12",null,"Total 2012-13",null,"Total 2013-14",null,"Total 2014-15",null,"Total 2015-16",null,"Total 2016-17",null,"Total 2017-18",null,"Total 2018-19",null,"Total 2019-20",null,"Total 2020-21",null,"Total 2021-22",null,"Total 2022-23",null,"Grant Total"]
[null,null,{"$f":"C59+C42+C25","v":0},null,{"$f":"E59+E42+E25","v":0},null,{"$f":"G59+G42+G25","v":0},null,{"$f":"I59+I42+I25","v":0},null,{"$f":"K59+K42+K25","v":0},null,{"$f":"M59+M42+M25","v":0},null,{"$f":"O59+O42+O25","v":0},null,{"$f":"Q59+Q42+Q25","v":0},null,{"$f":"S59+S42+S25","v":0},null,{"$f":"U59+U42+U25","v":0},null,{"$f":"W59+W42+W25","v":0},null,{"$f":"Y59+Y42+Y25+Y26","v":0},null,{"$f":"AA59+AA42+AA25","v":0},null,{"$f":"AC59+AC42+AC25","v":0},{"$f":"AD25+Y26+AD42+AD59","v":0},{"$f":"T5-AD63","v":0}]
[]
[null,null,null,null,null,null,null,null,null,null,null,null,null,null,null,null,null,null,null,null,null,null,null,null,null,null,{"$f":"IF(AD63=0,\"\",IF(T5-AD63=0,\" Congratulations ! You have completed data entry in this fileld successfully\",\"Caution ! Your data entry process in this field not completed or there may be errors in typing. Don't click CONTINUE BUTTON below, please check\"))","v":""}]
[null,null,null,null,null,null,null,null,null,null,null,null,null,null,null,null,null,null,null,null,null,null,null,null,null,{"$f":"IF(AD63=0,\"\",\"Total arrear amount included in your salary is Rs. \")","v":""},{"$f":"IF(Z66=\"\",\"\",T5)","v":""}]
[null,null,null,null,null,null,null,null,null,null,null,null,null,null,null,null,null,null,null,null,null,null,null,null,null,{"$f":"IF(AD63=0,\"\",\"Total arrear amount already apportioned by you now to different years, including deferred salary  is Rs. \")","v":""},{"$f":"IF($Z$66=\"\",\"\",AD63)","v":""}]
[null,null,null,null,null,null,null,null,null,null,null,{"$f":"IF(AA68<1,\"Error ! Arrear splitted to different years should not be more than arrears received\",IF(AA66=AA67,\"\",IF(AD63=0,\"\",IF(AD63>0,\"Balance arrear amount, still pending to apportion is Rs. \"))))","v":""},null,null,null,null,null,null,null,null,null,null,null,null,null,null,{"$f":"IF(AA66=AA67,\"\",IF($AA$66=\"\",\"\",AE63))","v":""}]
[]
[]
[null,null,null,null,null,null,null,null,null,null,null,null,null,null,null,null,null,null,null,null,null,null,null,null,null,null,6]
[]
[]
[]
[]
[]
[]
[]
[]
[]
[]
[]
[]
[]
[]
[]
[]
[]
[]
[]
[]
[]
[]
[]
[]
[]
[]
[]
[]
[]
[]
[]
[null,null,"Sorry, at present, the facility is  not provided in this system. 10E preparation field will be provided during updation"]
[null,null,"If you have already calculated the 89 (1) relief amount mannually or using any other alternative system, that relief amount (10E deduction amount)"]
[null,null,"can be typed in the box shown below to take the final print"]
[null,null,"നിർഭാഗ്യവശാൽ 10 E കണക്ക് കൂട്ടൽ സംവിധാനം ഈ സംവിധാനത്തിൽ "]
[null,null,null,null,null,null,null,"Rs"]

{"sheet":"new form 16","index":13,"n_rows":118,"n_cols":28,"rows_kept":118,"cut":false,"hidden":true,"merged":[[49,9,49,10],[44,7,44,8],[77,9,77,10],[68,7,68,8],[48,9,48,10],[43,1,43,6],[55,7,55,8],[99,14,99,16],[61,9,61,10],[61,7,61,8],[59,9,59,10],[85,1,85,8],[69,14,69,16],[70,9,70,10],[69,9,69,10],[70,1,70,6],[69,1,69,6],[63,1,63,6],[64,1,64,6],[63,7,63,8],[75,9,75,10],[75,7,75,8],[72,9,72,10],[69,7,69,8],[71,1,71,6],[37,9,37,10],[56,9,56,10],[53,9,53,10],[9,7,9,10],[10,7,10,10],[33,7,33,8],[11,7,11,10],[16,7,16,8],[12,9,12,10],[14,1,14,10],[13,1,13,4],[13,5,13,6],[15,1,15,2],[15,7,15,8],[15,9,15,10],[16,1,16,2],[15,3,15,6],[17,1,17,2],[17,7,17,8],[17,3,17,6],[55,9,55,10],[42,7,42,8],[46,1,46,8],[45,1,45,6],[23,9,23,10],[19,9,19,10],[19,3,19,6],[20,7,20,8],[20,1,20,6],[19,1,19,2],[35,9,36,10],[35,7,35,8],[36,7,36,8],[30,7,30,8],[22,9,22,10],[5,1,5,5],[5,6,5,10],[6,1,6,5],[6,6,6,10],[10,4,10,6],[7,6,7,10],[85,9,85,10],[66,1,66,6],[80,1,80,8],[76,1,76,6],[50,1,50,6],[21,1,21,10],[56,7,56,8],[52,7,52,8],[54,7,54,8],[24,9,24,10],[30,9,30,10],[44,1,44,6],[54,9,54,10],[51,9,51,10],[11,5,12,6],[11,1,12,4],[16,9,16,10],[18,1,18,2],[5,11,8,11],[27,11,29,13],[12,7,12,8],[24,1,24,8],[25,9,25,10],[25,1,25,8],[91,1,91,10],[90,1,90,10],[94,1,94,2],[87,1,87,8],[86,9,86,10],[86,4,86,8],[88,9,88,10],[87,9,87,10],[49,7,49,8],[50,9,50,10],[47,1,47,10],[93,6,94,10],[92,1,92,10],[59,7,59,8],[84,1,84,8],[79,9,79,10],[82,9,82,10],[94,3,94,5],[110,13,110,14],[67,9,67,10],[64,9,64,10],[66,9,66,10],[39,1,39,10],[40,7,40,8],[56,1,56,6],[53,1,53,6],[53,7,53,8],[54,1,54,6],[81,1,81,8],[76,7,76,8],[77,7,77,8],[83,9,83,10],[84,9,84,10],[76,9,76,10],[80,9,80,10],[81,9,81,10],[73,1,73,6],[45,7,45,8],[51,1,51,6],[100,1,100,10],[99,1,99,10],[89,1,89,10],[63,9,63,10],[66,7,66,8],[60,1,60,6],[58,9,58,10],[83,1,83,8],[78,9,78,10],[78,1,78,8],[79,6,79,8],[77,1,77,6],[75,1,75,6],[60,9,60,10],[68,9,68,10],[74,9,74,10],[73,7,73,8],[67,7,67,8],[72,1,72,6],[71,9,71,10],[67,1,67,6],[71,7,71,8],[73,9,73,10],[68,1,68,6],[72,7,72,8],[74,1,74,6],[74,7,74,8],[55,1,55,6],[65,1,65,6],[70,7,70,8],[60,7,60,8],[59,1,59,6],[64,7,64,8],[57,7,57,8],[57,1,57,6],[48,7,48,8],[62,7,62,8],[65,7,65,8],[58,7,58,8],[58,1,58,6],[61,1,61,6],[49,1,49,6],[48,1,48,6],[52,1,52,6],[51,7,51,8],[50,7,50,8],[7,1,8,5],[17,9,17,10],[41,1,41,6],[42,1,42,6],[32,7,32,8],[38,9,38,10],[38,1,38,8],[40,9,40,10],[40,1,40,6],[9,1,9,3],[18,3,18,6],[18,7,18,8],[18,9,18,10],[32,9,32,10],[41,9,41,10],[26,9,26,10],[41,7,41,8],[31,7,31,8],[28,7,28,8],[29,7,29,8],[19,7,19,8],[27,9,27,10],[20,9,20,10],[23,1,23,8],[4,1,4,6],[4,8,4,10],[0,1,0,10],[62,1,62,6],[44,9,44,10],[42,9,42,10],[65,9,65,10],[43,7,43,8],[26,1,26,8],[46,9,46,10],[31,9,31,10],[34,7,34,8],[8,6,8,10],[9,4,9,6],[13,9,13,10],[16,3,16,6],[13,7,13,8],[45,9,45,10],[33,9,33,10],[1,1,1,10],[2,1,2,10],[3,1,3,10],[37,7,37,8],[10,1,10,3]]}
[{"$f":"G7","v":0},"Click the red button to save the statement in PDF Format. This option is available only if you are using Excel 10 or above versions ഈ സൗകര്യം Excel 10 ഓ അതിനു മുകളിലുള്ളതോ ആയ Excel പതിപ്പാണ്‌ താങ്കള്‍ ഉപയോഗിക്കുന്നത് എങ്കില്‍ മാത്രം-- താങ്കള്‍  പഴയ excel പതിപ്പാണ്‌ ഉപയോഗിക്കുന്നതെങ്കില്‍   ഈ സോഫ്റ്റ്‌വെയര്‍ നോടൊപ്പം ലഭിച്ചിരിക്കുന്ന   PDF ഫയല്‍  വായിക്കുന്നതിലൂടെയും പരിഹാര മാര്‍ഗ്ഗം ലഭിക്കും  --ഫയല്‍  എവിടെയാണ് save ആകുന്നതെന്ന് ക്ലിക്ക് ചെയ്യുമ്പോള്‍ ലഭിക്കുന്ന സന്ദേശത്തില്‍ ലഭിക്കും .",null,null,null,null,null,null,null,null,null,null,null,1,"PRINT P 1","PRINT P 2"]
[{"$f":"B2","v":"FORM NO. 16 "},"FORM NO. 16 "]
[{"$f":"I5","v":"OLD REGIME RATE"},"[See rule 31(1)(a)] "]
[]
[null,"PART B (Annexure)",null,null,null,null,null,null,"OLD REGIME RATE"]
[null,"Name and address of the Employer   ",null,null,null,null,"Name and Designation of the Employee"]
[null,{"$f":"IF(PERSONAL!H18=\"Yes\",\"Government of Kerala\",\"\")","v":"Government of Kerala"},null,null,null,null,{"$f":"PERSONAL!H4","v":0}]
[null,{"$f":"PERSONAL!H10","v":"SALARY"},null,null,null,null,{"$f":"PERSONAL!H6","v":0}]
[null,null,null,null,null,null,{"$f":"'new statement'!L6","v":"Below 60 Years"}]
[null,"PAN of the Deductor  ",null,null," TAN of the Deductor",null,null," PAN of the Employee "]
[null,{"$f":"CUSTOMISE!H27","v":0},null,null,{"$f":"PERSONAL!H16","v":0},null,null,{"$f":"PERSONAL!H7","v":0}]
[null,"CIT (TDS) ",null,null,null,"Assessment Year ",null," Period"]
[null,null,null,null,null,null,null,"From",null,"To"]
[null,{"$f":"PERSONAL!H17","v":0},null,null,null,"2021-2022",null,"April-2020",null,"March-2021"]
[null,"Summary of tax deducted at source "]
[null,"Quarter  ",null,"Receipt Numbers of original statements of TDS under sub-section (3) of section 200  ",null,null,null,"Amount of tax deducted in respect of the employee  ",null,"Amount of tax deposited remitted in respect of the employee   "]
[null,"Quarter 1",null,{"$f":"'tds det'!#REF!","v":{"$error":"#REF!"}},null,null,null,{"$f":"'tds det'!#REF!","v":{"$error":"#REF!"}},null,{"$f":"H17","v":{"$error":"#REF!"}}]
[null,"Quarter 2",null,{"$f":"'tds det'!#REF!","v":{"$error":"#REF!"}},null,null,null,{"$f":"'tds det'!#REF!","v":{"$error":"#REF!"}},null,{"$f":"H18","v":{"$error":"#REF!"}}]
[null,"Quarter 3",null,{"$f":"'tds det'!#REF!","v":{"$error":"#REF!"}},null,null,null,{"$f":"'tds det'!#REF!","v":{"$error":"#REF!"}},null,{"$f":"H19","v":{"$error":"#REF!"}}]
[null,"Quarter 4",null,{"$f":"'tds det'!#REF!","v":{"$error":"#REF!"}},null,null,null,{"$f":"'tds det'!#REF!","v":{"$error":"#REF!"}},null,{"$f":"\"due   \"&H20","v":{"$error":"#REF!"}}]
[null,"Total (including due )       ",null,null,null,null,null,{"$f":"'tds det'!G3","v":{"$error":"#REF!"}},null,{"$f":"H21","v":{"$error":"#REF!"}}]
[null,"PART B  (Refer Note 1)   Details of Salary paid and any other income and tax deducted "]
[null,"1.  Gross Salary  Rs.     ",null,"before standard deduction Rs 50000",null,null,null,null,null,{"$f":"J27+50000","v":{"$error":"#VALUE!"}}]
[null,"(a)  Salary as per provisions contained in sec.17(1) EXCLUDES PAY REVISION INTEREST",null,null,null,null,null,null,null,{"$f":"'new statement'!W9-'new statement'!R21","v":0}]
[null,"(b)  Value of perquisites u/s 17(2) (as per Form No.12BB, wherever applicable)",null,null,null,null,null,null,null,{"$f":"'new statement'!T10","v":0}]
[null,"(c)  Profits in lieu of salary under section 17(3) (as per Form No.12BB, wherever applicable)  ",null,null,null,null,null,null,null,{"$f":"'new statement'!T11","v":0}]
[null,"    Total salary income  after deductiing Standard deduction  Rs. 50000  Rs.   ",null,null,null,null,null,null,null,{"$f":"IF(SUM(J24:K26)>0,SUM(J24:K26),\"Nil\")","v":"Nil"}]
[null,"2.  Less Allowance to the extent exempt u/s 10",null,null,null,null,null,null,null,null,null,{"$f":"'new statement'!W5","v":""}]
[null,"a. House Rent Allowance (HRA)",null,null,null,null,null,{"$f":"'new statement'!R17","v":0}]
[null,"b",{"$f":"INVEST!D28","v":""},null,null,null,{"$f":"IF(O30>0,\"\",\"NIL\")","v":"NIL"},{"$f":"INVEST!F28","v":0},null,null,null,null,null,null,{"$f":"INVEST!F28","v":0}]
[null,"c",{"$f":"INVEST!D29","v":""},null,null,null,{"$f":"IF(O31>0,\"\",\"NIL\")","v":"NIL"},{"$f":"INVEST!F29","v":0},null,null,null,null,null,null,{"$f":"INVEST!F29","v":0}]
[null,"d",{"$f":"INVEST!D30","v":""},null,null,null,{"$f":"IF(O32>0,\"\",\"NIL\")","v":"NIL"},{"$f":"INVEST!F30","v":0},null,null,null,null,null,null,{"$f":"INVEST!F30","v":0}]
[null,"e",{"$f":"INVEST!D31","v":""},null,null,null,{"$f":"IF(O33>0,\"\",\"NIL\")","v":"NIL"},{"$f":"INVEST!F31","v":0},null,null,null,null,null,null,{"$f":"INVEST!F31","v":0}]
[null,"3. Total allowances exempted u/s 10",null,null,null,null,null,{"$f":"SUM(H29:I33)","v":0},null,null,null,null,null,null,{"$f":"INVEST!F32","v":0}]
[null,"4.   Deductions :       "]
[null,"  (a)  Entertainment allowance  Rs.     ",null,null,null,null,null,{"$f":"'det.sal input'!W35","v":0}]
[null,"  (b)  Tax on employment  Rs.     ",null,null,null,null,null,{"$f":"'det.sal input'!W31","v":0}]
[null,"5.  Aggregate of 3 and  4    Rs.   ",null,null,null,null,null,{"$f":"H34+H36+H37","v":0}]
[null,"6.  Income chargeable under the head 'salaries' (3-5)      Rs.  ",null,null,null,null,null,null,null,{"$f":"IF(N1=2,J27,J27-H38)","v":{"$error":"#VALUE!"}},null,null,null,null,null,null,null,null,null,null,null,null,null,null,null,null,"new tax inc","tax "]
[null,"7.  Add: Any other income reported by the employee       ",null,null,null,null,null,null,null,null,null,null,null,null,null,null,null,null,null,null,null,null,null,null,null,null,{"$f":"J80","v":0},{"$f":"IF(AA40<250001,0,IF(AA40<500001,(AA40-250000)/20,IF(AA40<750001,(12500+(AA40-500000)/10),IF(AA40<1000001,(37500+(AA40-750000)*15/100),IF(AA40<1250001,75000+(AA40-1000000)/5,IF(AA40<1500001,125000+(AA40-1250000)/4,187500+(AA40-1500000)*30/100))))))","v":0}]
[null,"  Income ",null,null,null,null,null," Rs.       "]
[null,"Income from House property",null,null,null,null,null,{"$f":"'new statement'!O23","v":0}]
[null,"Income from other sources INTEREST ON PAY REVISION ARREAR (Interest/ Family pension)",null,null,null,null,null,{"$f":"'new statement (2)'!O24","v":0}]
[null,"Income from business or profession",null,null,null,null,null,{"$f":"'new statement'!O25","v":0}]
[null,"Capital gain income",null,null,null,null,null,{"$f":"'new statement'!O26","v":0}]
[null,"Total       ",null,null,null,null,null,{"$f":"'new statement'!AH258","v":""},null,{"$f":"'new statement'!R26","v":0}]
[null,"8.  Gross total income (6+7)     Rs.  ",null,null,null,null,null,null,null,{"$f":"SUM(J39,J46)","v":{"$error":"#VALUE!"}}]
[null,"9.  Deductions under Chapter  VIA       "]
[null,"        Sections 80C, 80CCC and 80CCD       ",null,null,null,null,null,"Gross Amount",null,"Deductible Amount "]
[null,"   (i) Section 80C     "]
[null,"Providend fund contribution",null,null,null,null,null,{"$f":"'new statement'!O30","v":0}]
[null,"State Life Insurance Policy (SLI)",null,null,null,null,null,{"$f":"'new statement'!O31","v":0}]
[null,"Group Insurance Scheme (GIS)",null,null,null,null,null,{"$f":"'new statement'!O32","v":0}]
[null,"Tax saving Fixed deposits",null,null,null,null,null,{"$f":"'new statement'!O33","v":0}]
[null,"Life Insurence  salary deduction",null,null,null,null,null,{"$f":"'new statement'!O34","v":0}]
[null,"Life Insurence other than salary deduction ",null,null,null,null,null,{"$f":"'new statement'!O35","v":0}]
[null,{"$f":"'det.sal input'!R6&\" +  \"&'det.sal input'!T6","v":"? +  ?"},null,null,null,null,null,{"$f":"'new statement'!O36","v":0}]
[null,"NSC VIII th issue (Nationional Savings certificate)",null,null,null,null,null,{"$f":"'new statement'!O37","v":0}]
[null,"Public Provident Fund (PPF)",null,null,null,null,null,{"$f":"'new statement'!O38","v":0}]
[null,"ULIP/ Tax saving mutual funds",null,null,null,null,null,{"$f":"'new statement'!O39","v":0}]
[null,"Tuition Fees",null,null,null,null,null,{"$f":"'new statement'!O40","v":0}]
[null,"Housing Loan Repayment (PRINCIPAL PORTION ONLY)",null,null,null,null,null,{"$f":"'new statement'!O41","v":0}]
[null,{"$f":"'new statement'!D42","v":0},null,null,null,null,null,{"$f":"'new statement'!O42","v":0}]
[null,"  (ii)   Section 80CCC               ",null,null,null,null,null,{"$f":"'new statement'!O43","v":0}]
[null,"Employee Contrubution to National Pension Scheme - NPS (80CCD)",null,null,null,null,null,{"$f":"'new statement'!O44","v":0}]
[null,"Total investment under  Sec.  80C, 80CCC, 80CCD",null,null,null,null,null,{"$f":"'new statement'!O45","v":0},null,{"$f":"IF(N1=2,0,'new statement'!R45)","v":0}]
[null,"Employee Contrubution to National Pension Scheme  - NPS 80CCD(1B) investment over 1.5 lakh",null,null,null,null,null,{"$f":"'new statement'!O46","v":0},null,{"$f":"IF(N1=2,0,H67)","v":0}]
[null,"Employer's contribution to NPS [Up to 10% Pay+Da+AGPgets excemption u/s Section 80CCD(2)]",null,null,null,null,null,{"$f":"'new statement'!O47","v":0},null,{"$f":"H68","v":0},null,null,null,"OLD RATE tax calculating table actual basis",null,null,null,null,null,null,null,null,null,null,"OLD RATE TAX WITHOUT DEDUCTIONS"]
[null," Investment in Rajiv Gandhi Equity Savings Scheme 80CCG (50% of investment gets excemption.Maximum 25000)",null,null,null,null,null,{"$f":"'new statement'!O48","v":0},null,{"$f":"H69","v":0}]
[null," Other sections (e.g. 80E, 80G etc.) under Chapter VI-A  ",null,null,null,null,null,"Qualifying Amount",null,"Deductible Amount ",null,null,"tax calculation-men","below 60",null,null,null,null,"cenior citizen",null,null,null,"cenior above 80",null,"60 LESS","SENIOR","SUP SENI"]
[null,"Mediclame 80 D",null,null,null,null,null,{"$f":"'new statement'!O49","v":0},null,null,null,null,"aggragate income",{"$f":"J80","v":0},null,null,null,null,{"$f":"J80","v":0},null,null,null,{"$f":"J80","v":0},null,{"$f":"'new statement'!R59","v":0},{"$f":"Y71","v":0},{"$f":"Z71","v":0}]
[null,"Handicaped dependent medical treatment 80 DD ",null,null,null,null,null,{"$f":"'new statement'!O50","v":0},null,null,null,null,"basic deduction",250000,null,null,null,null,300000,null,null,null,500000,null,250000,300000,500000]
[null,"Treatment of chronic diseases 80 DDB",null,null,null,null,null,{"$f":"'new statement'!O51","v":0}]
[null,"Education Loan Interest repayment 80 E",null,null,null,null,null,{"$f":"'new statement'!O52","v":0},null,null,null,null,"balance",{"$f":"IF(N72>N71,0,N71-N72)","v":0},null,null,null,null,{"$f":"IF(S72>S71,0,S71-S72)","v":0},{"$f":"IF(T72>T71,0,T71-T72)","v":0},{"$f":"IF(U72>U71,0,U71-U72)","v":0},{"$f":"IF(V72>V71,0,V71-V72)","v":0},{"$f":"IF(W72>W71,0,W71-W72)","v":0},null,{"$f":"Y71-Y72","v":-250000},{"$f":"Z71-Z72","v":-300000},{"$f":"AA71-AA72","v":-500000}]
[null,"Donation to special funds 80 G including FLOOD RELIEF FUND",null,null,null,null,null,{"$f":"'new statement'!O55","v":0},null,null,null,null,"stage 1 tax",{"$f":"IF(N71>=500000,12500,N74*0.05)","v":0},{"$f":"IF(O71>=500000,30000,O74*0.1)","v":0},{"$f":"IF(P71>=500000,30000,P74*0.1)","v":0},{"$f":"IF(Q71>=500000,30000,Q74*0.1)","v":0},{"$f":"IF(R71>=500000,30000,R74*0.1)","v":0},{"$f":"IF(S71>=500000,10000,S74*0.05)","v":0},null,null,null,{"$f":"IF(W74<=500000,W74*0.2,100000)","v":0},null,{"$f":"IF(Y71>=500000,12500,Y74*0.05)","v":-12500},{"$f":"IF(Z71>=500000,10000,Z74*0.05)","v":-15000},{"$f":"IF(AA74<=500000,AA74*0.2,100000)","v":-100000}]
[null,"Deduction for handicaped employees 80 U",null,null,null,null,null,{"$f":"'new statement'!O56","v":0},null,null,null,null,"stage 2 tax",{"$f":"IF(N71<=500000,0,IF(N71<=1000000,(N71-500000)*0.2,IF(N71>1000000,100000)))","v":0},0,0,0,0,0,null,null,null,{"$f":"IF(W74>500000,(W74-500000)*0.3)","v":false},null,{"$f":"IF(Y71<=500000,0,IF(Y71<=1000000,(Y71-500000)*0.2,IF(Y71>1000000,100000)))","v":0},{"$f":"IF(Z71<=500000,0,IF(Z71<=1000000,(Z71-500000)*0.2,IF(Z71>1000000,100000)))","v":0},{"$f":"IF(AA74>500000,(AA74-500000)*0.3)","v":false}]
[null,null,null,null,null,null,null,null,null,null,null,null,"stage 3 tax",{"$f":"IF(N71<=1000000,0,(N71-1000000)*0.3)","v":0},0,0,0,0,0,0,0,0,null,null,{"$f":"IF(Y71<=1000000,0,(Y71-1000000)*0.3)","v":0},{"$f":"IF(Z71<=1000000,0,(Z71-1000000)*0.3)","v":0}]
[null,null,null,null,null,null,null,{"$f":"'new statement'!O58","v":0},null,null,null,null,"total",{"$f":"N75+N76+N77","v":0},null,null,null,null,{"$f":"S76+S77+S75","v":0},{"$f":"T76+T77+T75","v":0},{"$f":"U76+U77+U75","v":0},{"$f":"V76+V77+V75","v":0},{"$f":"W76+W77+W75","v":0},null,{"$f":"Y75+Y76+Y77","v":-12500},{"$f":"Z76+Z77+Z75","v":-15000},{"$f":"AA76+AA77+AA75","v":-100000}]
[null,"10.  Aggregate of deductible amount",null,null,null,null,null,null,null,{"$f":"IF(N1=2,H68,SUM(J66:K69)+SUM(H71:I78))","v":0},null,null,"stage 3 tax",{"$f":"IF(N71<=1000000,0,(N71-1000000)*0.3)","v":0},null,null,null,null,null,null,null,null,null,null,{"$f":"IF(Y71<=1000000,0,(Y71-1000000)*0.3)","v":0},{"$f":"IF(Z71<=1000000,0,(Z71-1000000)*0.3)","v":0}]
[null,"11. Total Income or Taxable income (8-10)    ",null,null,null,null,{"$f":"\"( Rs.\"&J47-J79 & \"  Rounded to Ten)\"","v":{"$error":"#VALUE!"}},null,null,{"$f":"'new statement'!R59","v":0},null,null,"tax=",{"$f":"IF(PERSONAL!H5=\"BELOW 60 YEARS\",'new form 16'!N78,IF(PERSONAL!H5=\"60 to 79 Years\",'new form 16'!S78,'new form 16'!W78))","v":0},null,null,null,null,null,null,null,null,null,null,{"$f":"IF(PERSONAL!H5=\"BELOW 60 YEARS\",'new form 16'!Y78,IF(PERSONAL!H5=\"60 to 79 Years\",'new form 16'!Z78,'new form 16'!AA78))","v":-12500}]
[null,"12. Income Tax",null,null,null,null,null,null,null,{"$f":"IF(N1=2,AB40,ROUND(N80,0))","v":0},null,null,"less tax credit"]
[null,"13. Less Rebate 87A (Maximum of Rs. 12500) available if Point 11 is <500001",null,null,null,null,null,null,null,{"$f":"ROUND(N86,0)","v":0},{"$f":"N86","v":0},null,"Actual tax",{"$f":"ROUND(N80,0)","v":0},null,null,null,null,{"$f":"S78","v":0},null,null,null,{"$f":"W78","v":0}]
[null,"14. Tax after 87A rebate",null,null,null,null,null,null,null,{"$f":"J81-J82","v":0}]
[null,"15. Education cess @ 4% of income tax",null,null,null,null,null,null,null,{"$f":"ROUND((J81-K82)*0.04,0)","v":0},null,null,"10% of taxable inc:",{"$f":"N71*0.1","v":0}]
[null,"16.  Total Tax Payable including cess",null,null,null,null,null,null,null,{"$f":"J81-K82+J84","v":0},null,null,"maximum tax credit:",{"$f":"IF(J81<=0,0,IF(N71<=500000,12500,0))","v":0}]
[null,"17.  Less: Relief under section 89 (attach details)   ",null,null,null,null,null,null,null,{"$f":"ROUND(('new statement'!R65),0)","v":0},null,{"$f":"ROUND(J87,-1)","v":0},"Actual 87a amt",{"$f":"MIN(N82:N85)","v":0}]
[null,"18. Tax payable/ refundable ",null,null,{"$f":"\"[Rounded value to ten is Rs \"&L86&\"]\"","v":"[Rounded value to ten is Rs 0]"},null,null,null,null,{"$f":"L87","v":0},null,{"$f":"IF(J85>J86,J85-J86,0)","v":0}]
[]
[]
[null,"Verification ",null,null,null,null,null,null,null,null,null,null,"Form 16 ഇന്‍കംടാക്സ് വകുപ്പ് തയ്യാറാക്കുന്ന പ്രത്യേക ഫോര്‍മാറ്റിലുള്ള"]
[null,{"$f":"\"I, \"&PERSONAL!H12&\" ,son/daughter of \"&PERSONAL!H13&\" working in the capacity of \"& PERSONAL!H14&\" do hereby certify that\"","v":"I, 0 ,son/daughter of SELECT HRA CLASS working in the capacity of 0 do hereby certify that"},null,null,null,null,null,null,null,null,null,null,"രേഖയാണ്. അതില്‍ മൊത്തത്തില്‍ ഒരു വര്‍ഷത്തില്‍ അടക്കേണ്ട നികുതി "]
[null,"the information given above is true, complete and correct and is based on the books of",null,null,null,null,null,null,null,null,null,null,"മാത്രമേ കാണിക്കുകയുള്ളൂ. അല്ലാതെ ഇതിനകം അടച്ച നികുതിയും "]
[null,"account, documents, TDS statements, and other available records",null,null,null,null,null,null,null,null,null,null,"ബാക്കി അടക്കാനുള്ള നികുതിയും പ്രത്യേകം കാണിക്കുകയില്ല."]
[null,{"$f":"PERSONAL!H11","v":0},null,null,null,null,{"$f":"\"Signature of  \"&PERSONAL!H12","v":"Signature of  0"},null,null,null,null,null,"10 ലേക്ക് ROUND  ചെയ്ത നികുതി സംഖ്യയാണ് ശരിയായ നികുതി. "]
[null,{"$f":"TEXT(TODAY(),\"dd/mm/yyyy\")","v":"05/02/2024"},null,"http://babuvadukkumchery.blogspot.com",null,null,null,null,null,null,null,null,"ROUND ചെയ്യാത്ത തുക ഇവിടെ വെറുതെ  "]
[null,null,null,null,null,null,null,null,null,null,{"$f":"PERSONAL!H14","v":0},null,"അറിവിലേക്കായി നല്‍കീ എന്നേ കരുതേണ്ടൂ "]
[]
[]
[null,null,null,null,null,null,null,null,null,null,null,null,null,"tax calculating table accrual basis"]
[null,null,null,null,null,null,null,null,null,null,null,null,"tax calculation-men","below 60",null,null,null,null,"cenior citizen",null,null,null,"cenior above 80"]
[null,null,null,null,null,null,null,null,null,null,null,null,"aggragate income",{"$f":"Data!E36-Data!R35","v":2},null,null,null,null,{"$f":"N101","v":2},null,null,null,{"$f":"N101","v":2}]
[null,null,null,null,null,null,null,null,null,null,null,null,"basic deduction",250000,null,null,null,null,300000,null,null,null,500000]
[]
[null,null,null,null,null,null,null,null,null,null,null,null,"balance",{"$f":"IF(N102>N101,0,N101-N102)","v":0},null,null,null,null,{"$f":"IF(S102>S101,0,S101-S102)","v":0},{"$f":"IF(T102>T101,0,T101-T102)","v":0},{"$f":"IF(U102>U101,0,U101-U102)","v":0},{"$f":"IF(V102>V101,0,V101-V102)","v":0},{"$f":"IF(W102>W101,0,W101-W102)","v":0}]
[]
[null,null,null,null,null,null,null,null,null,null,null,null,"stage 1 tax",{"$f":"IF(N101>=500000,12500,N104*0.05)","v":0},{"$f":"IF(O101>=500000,30000,O104*0.1)","v":0},{"$f":"IF(P101>=500000,30000,P104*0.1)","v":0},{"$f":"IF(Q101>=500000,30000,Q104*0.1)","v":0},{"$f":"IF(R101>=500000,30000,R104*0.1)","v":0},{"$f":"IF(S101>=500000,10000,S104*0.05)","v":0},null,null,null,{"$f":"IF(W104<=500000,W104*0.2,100000)","v":0}]
[null,null,null,null,null,null,null,null,null,null,null,null,"stage 2 tax",{"$f":"IF(N101<=500000,0,IF(N101<=1000000,(N101-500000)*0.2,IF(N101>1000000,100000)))","v":0},0,0,0,0,0,null,null,null,{"$f":"IF(W104>500000,(W104-500000)*0.3)","v":false}]
[null,null,null,null,null,null,null,null,null,null,null,null,"stage 3 tax",{"$f":"IF(N101<=1000000,0,(N101-1000000)*0.3)","v":0},0,0,0,0,0,0,0,0]
[null,null,null,null,null,null,null,null,null,null,null,null,"total",{"$f":"N106+N107+N108","v":0},null,null,null,null,{"$f":"S107+S108+S106","v":0},{"$f":"T107+T108+T106","v":0},{"$f":"U107+U108+U106","v":0},{"$f":"V107+V108+V106","v":0},{"$f":"W107+W108+W106","v":0}]
[]
[null,null,null,null,null,null,null,null,null,null,null,null,"tax=",{"$f":"IF(PERSONAL!H5=\"BELOW 60 YEARS\",'new form 16'!N109,IF(PERSONAL!H5=\"60 to 79 Years\",'new form 16'!S109,'new form 16'!W109))","v":0}]
[null,null,null,null,null,null,null,null,null,{"$f":"N111","v":0},null,null,"less tax credit"]
[null,null,null,null,null,null,null,null,null,null,null,null,"Actual tax",{"$f":"N111","v":0},null,null,null,null,{"$f":"S109","v":0},null,null,null,{"$f":"W109","v":0}]
[]
[null,null,null,null,null,null,null,null,null,null,null,null,"10% of taxable inc:",{"$f":"N101*0.1","v":0.2}]
[null,null,null,null,null,null,null,null,null,null,null,null,"maximum tax credit:",{"$f":"IF(J112<=0,0,IF(N101<=500000,12500,0))","v":0}]
[null,null,null,null,null,null,null,null,null,null,null,null,"Actual 87a amt",{"$f":"MIN(N113,N115,N116)","v":0}]
[null,null,null,null,null,null,null,null,null,null,null,null,"Tax due",{"$f":"N111-N117","v":0}]

{"sheet":" Form 16 NEW REGIME","index":14,"n_rows":117,"n_cols":28,"rows_kept":117,"cut":false,"hidden":true,"merged":[[0,1,0,10],[1,1,1,10],[2,1,2,10],[3,1,3,10],[4,1,4,6],[4,8,4,10],[9,1,9,3],[9,4,9,6],[9,7,9,10],[10,1,10,3],[10,4,10,6],[10,7,10,10],[5,1,5,5],[5,6,5,10],[5,11,8,11],[6,1,6,5],[6,6,6,10],[7,1,8,5],[7,6,7,10],[8,6,8,10],[11,1,12,4],[11,5,12,6],[11,7,11,10],[12,7,12,8],[12,9,12,10],[13,1,13,4],[13,5,13,6],[13,7,13,8],[13,9,13,10],[14,1,14,10],[15,1,15,2],[15,3,15,6],[15,7,15,8],[15,9,15,10],[16,1,16,2],[16,3,16,6],[16,7,16,8],[16,9,16,10],[19,1,19,2],[19,3,19,6],[19,7,19,8],[19,9,19,10],[20,1,20,6],[20,7,20,8],[20,9,20,10],[17,1,17,2],[17,3,17,6],[17,7,17,8],[17,9,17,10],[18,1,18,2],[18,3,18,6],[18,7,18,8],[18,9,18,10],[25,1,25,8],[25,9,25,10],[26,1,26,8],[26,9,26,10],[27,9,27,10],[27,11,29,13],[28,7,28,8],[29,7,29,8],[21,1,21,10],[22,9,22,10],[23,1,23,8],[23,9,23,10],[24,1,24,8],[24,9,24,10],[33,7,33,8],[33,9,33,10],[34,7,34,8],[35,7,35,8],[35,9,36,10],[36,7,36,8],[30,7,30,8],[30,9,30,10],[31,7,31,8],[31,9,31,10],[32,7,32,8],[32,9,32,10],[41,1,41,6],[41,7,41,8],[41,9,41,10],[42,1,42,6],[42,7,42,8],[42,9,42,10],[37,7,37,8],[37,9,37,10],[38,1,38,8],[38,9,38,10],[39,1,39,10],[40,1,40,6],[40,7,40,8],[40,9,40,10],[46,1,46,8],[46,9,46,10],[47,1,47,10],[48,1,48,6],[48,7,48,8],[48,9,48,10],[43,1,43,6],[43,7,43,8],[44,1,44,6],[44,7,44,8],[44,9,44,10],[45,1,45,6],[45,7,45,8],[45,9,45,10],[51,1,51,6],[51,7,51,8],[51,9,51,10],[52,1,52,6],[52,7,52,8],[53,1,53,6],[53,7,53,8],[53,9,53,10],[49,1,49,6],[49,7,49,8],[49,9,49,10],[50,1,50,6],[50,7,50,8],[50,9,50,10],[56,1,56,6],[56,7,56,8],[56,9,56,10],[57,1,57,6],[57,7,57,8],[58,1,58,6],[58,7,58,8],[58,9,58,10],[54,1,54,6],[54,7,54,8],[54,9,54,10],[55,1,55,6],[55,7,55,8],[55,9,55,10],[61,1,61,6],[61,7,61,8],[61,9,61,10],[62,1,62,6],[62,7,62,8],[63,1,63,6],[63,7,63,8],[63,9,63,10],[59,1,59,6],[59,7,59,8],[59,9,59,10],[60,1,60,6],[60,7,60,8],[60,9,60,10],[66,1,66,6],[66,7,66,8],[66,9,66,10],[67,1,67,6],[67,7,67,8],[67,9,67,10],[64,1,64,6],[64,7,64,8],[64,9,64,10],[65,1,65,6],[65,7,65,8],[65,9,65,10],[69,14,69,16],[70,1,70,6],[70,7,70,8],[70,9,70,10],[71,1,71,6],[71,7,71,8],[71,9,71,10],[68,1,68,6],[68,7,68,8],[68,9,68,10],[69,1,69,6],[69,7,69,8],[69,9,69,10],[74,1,74,6],[74,7,74,8],[74,9,74,10],[75,1,75,6],[75,7,75,8],[75,9,75,10],[72,1,72,6],[72,7,72,8],[72,9,72,10],[73,1,73,6],[73,7,73,8],[73,9,73,10],[78,1,78,8],[78,9,78,10],[79,6,79,8],[79,9,79,10],[80,1,80,8],[80,9,80,10],[76,1,76,6],[76,7,76,8],[76,9,76,10],[77,1,77,6],[77,7,77,8],[77,9,77,10],[85,1,85,8],[85,9,85,10],[86,4,86,8],[86,9,86,10],[87,1,87,8],[87,9,87,10],[81,1,81,8],[81,9,81,10],[82,9,82,10],[83,1,83,8],[83,9,83,10],[84,1,84,8],[84,9,84,10],[99,1,99,10],[99,14,99,16],[100,1,100,10],[110,13,110,14],[88,9,88,10],[89,1,89,10],[90,1,90,10],[91,1,91,10],[92,1,92,10],[93,6,94,10],[94,1,94,2],[94,3,94,5]]}
[{"$f":"G7","v":0},"Click the red button to save the statement in PDF Format. This option is available only if you are using Excel 10 or above versions ഈ സൗകര്യം Excel 10 ഓ അതിനു മുകളിലുള്ളതോ ആയ Excel പതിപ്പാണ്‌ താങ്കള്‍ ഉപയോഗിക്കുന്നത് എങ്കില്‍ മാത്രം-- താങ്കള്‍  പഴയ excel പതിപ്പാണ്‌ ഉപയോഗിക്കുന്നതെങ്കില്‍   ഈ സോഫ്റ്റ്‌വെയര്‍ നോടൊപ്പം ലഭിച്ചിരിക്കുന്ന   PDF ഫയല്‍  വായിക്കുന്നതിലൂടെയും പരിഹാര മാര്‍ഗ്ഗം ലഭിക്കും  --ഫയല്‍  എവിടെയാണ് save ആകുന്നതെന്ന് ക്ലിക്ക് ചെയ്യുമ്പോള്‍ ലഭിക്കുന്ന സന്ദേശത്തില്‍ ലഭിക്കും .",null,null,null,null,null,null,null,null,null,null,null,1,"PRINT P 1","PRINT P 2"]
[{"$f":"B2","v":"FORM NO. 16 "},"FORM NO. 16 "]
[{"$f":"I5","v":"NEW REGIME RATE"},"[See rule 31(1)(a)] "]
[]
[null,"PART B (Annexure)",null,null,null,null,null,null,"NEW REGIME RATE"]
[null,"Name and address of the Employer   ",null,null,null,null,"Name and Designation of the Employee"]
[null,{"$f":"IF(PERSONAL!H18=\"Yes\",\"Government of Kerala\",\"\")","v":"Government of Kerala"},null,null,null,null,{"$f":"PERSONAL!H4","v":0}]
[null,{"$f":"PERSONAL!H10","v":"SALARY"},null,null,null,null,{"$f":"PERSONAL!H6","v":0}]
[null,null,null,null,null,null,{"$f":"'new statement'!L6","v":"Below 60 Years"}]
[null,"PAN of the Deductor  ",null,null," TAN of the Deductor",null,null," PAN of the Employee "]
[null,{"$f":"CUSTOMISE!H27","v":0},null,null,{"$f":"PERSONAL!H16","v":0},null,null,{"$f":"PERSONAL!H7","v":0}]
[null,"CIT (TDS) ",null,null,null,"Assessment Year ",null," Period"]
[null,null,null,null,null,null,null,"From",null,"To"]
[null,{"$f":"PERSONAL!H17","v":0},null,null,null,"2021-2022",null,"April-2020",null,"March-2021"]
[null,"Summary of tax deducted at source "]
[null,"Quarter  ",null,"Receipt Numbers of original statements of TDS under sub-section (3) of section 200  ",null,null,null,"Amount of tax deducted in respect of the employee  ",null,"Amount of tax deposited remitted in respect of the employee   "]
[null,"Quarter 1",null,{"$f":"'tds det'!#REF!","v":{"$error":"#REF!"}},null,null,null,{"$f":"'tds det'!#REF!","v":{"$error":"#REF!"}},null,{"$f":"H17","v":{"$error":"#REF!"}}]
[null,"Quarter 2",null,{"$f":"'tds det'!#REF!","v":{"$error":"#REF!"}},null,null,null,{"$f":"'tds det'!#REF!","v":{"$error":"#REF!"}},null,{"$f":"H18","v":{"$error":"#REF!"}}]
[null,"Quarter 3",null,{"$f":"'tds det'!#REF!","v":{"$error":"#REF!"}},null,null,null,{"$f":"'tds det'!#REF!","v":{"$error":"#REF!"}},null,{"$f":"H19","v":{"$error":"#REF!"}}]
[null,"Quarter 4",null,{"$f":"'tds det'!#REF!","v":{"$error":"#REF!"}},null,null,null,{"$f":"'tds det'!#REF!","v":{"$error":"#REF!"}},null,{"$f":"\"due   \"&H20","v":{"$error":"#REF!"}}]
[null,"Total (including due )       ",null,null,null,null,null,{"$f":"'tds det'!G3","v":{"$error":"#REF!"}},null,{"$f":"H21","v":{"$error":"#REF!"}}]
[null,"PART B  (Refer Note 1)   Details of Salary paid and any other income and tax deducted "]
[null,"1.  Gross Salary  Rs.     ",null,"No standard deduction is allowed in New regime",null,null,null,null,null,{"$f":"J27","v":"Nil"}]
[null,"(a)  Salary as per provisions contained in sec.17(1) EXCLUDES PAY REVISION INTEREST",null,null,null,null,null,null,null,{"$f":"'new statement (2)'!R22","v":0}]
[null,"(b)  Value of perquisites u/s 17(2) (as per Form No.12BB, wherever applicable)",null,null,null,null,null,null,null,{"$f":"'new statement'!T10","v":0}]
[null,"(c)  Profits in lieu of salary under section 17(3) (as per Form No.12BB, wherever applicable)  ",null,null,null,null,null,null,null,{"$f":"'new statement'!T11","v":0}]
[null,"    Total salary income  ",null,null,null,null,null,null,null,{"$f":"IF(SUM(J24:K26)>0,SUM(J24:K26),\"Nil\")","v":"Nil"}]
[null,"2.  Less Allowance to the extent exempt u/s 10",null,null,null,null,null,null,null,null,null,{"$f":"'new statement'!W5","v":""}]
[null,"a. House Rent Allowance (HRA)",null,null,null,null,null,{"$f":"'new statement'!R17","v":0}]
[null,"b",{"$f":"INVEST!D28","v":""},null,null,null,{"$f":"IF(O30>0,\"\",\"NIL\")","v":"NIL"},{"$f":"INVEST!F28","v":0},null,null,null,null,null,null,{"$f":"INVEST!F28","v":0}]
[null,"c",{"$f":"INVEST!D29","v":""},null,null,null,{"$f":"IF(O31>0,\"\",\"NIL\")","v":"NIL"},{"$f":"INVEST!F29","v":0},null,null,null,null,null,null,{"$f":"INVEST!F29","v":0}]
[null,"d",{"$f":"INVEST!D30","v":""},null,null,null,{"$f":"IF(O32>0,\"\",\"NIL\")","v":"NIL"},{"$f":"INVEST!F30","v":0},null,null,null,null,null,null,{"$f":"INVEST!F30","v":0}]
[null,"e",{"$f":"INVEST!D31","v":""},null,null,null,{"$f":"IF(O33>0,\"\",\"NIL\")","v":"NIL"},{"$f":"INVEST!F31","v":0},null,null,null,null,null,null,{"$f":"INVEST!F31","v":0}]
[null,"3. Total allowances exempted u/s 10",null,null,null,null,null,{"$f":"SUM(H30:I33)","v":0},null,null,null,null,null,null,{"$f":"INVEST!F32","v":0}]
[null,"4.   Deductions :       "]
[null,"  (a)  Entertainment allowance  Rs.     ",null,null,null,null,null,{"$f":"'det.sal input'!W35","v":0}]
[null,"  (b)  Tax on employment  Rs.     ",null,null,null,null,null,{"$f":"'det.sal input'!W31","v":0}]
[null,"5.  Aggregate of 3 and  4    Rs.   ",null,null,null,null,null,{"$f":"H34+H36+H37","v":0}]
[null,"6.  Income chargeable under the head 'salaries' (3-5)      Rs.  ",null,null,null,null,null,null,null,{"$f":"IF(N1=2,J27,J27-H38)","v":{"$error":"#VALUE!"}},null,null,null,null,null,null,null,null,null,null,null,null,null,null,null,null,"new tax inc","tax "]
[null,"7.  Add: Any other income reported by the employee       ",null,null,null,null,null,null,null,null,null,null,null,null,null,null,null,null,null,null,null,null,null,null,null,null,{"$f":"J80","v":0},{"$f":"IF(AA40<250001,0,IF(AA40<500001,(AA40-250000)/20,IF(AA40<750001,(12500+(AA40-500000)/10),IF(AA40<1000001,(37500+(AA40-750000)*15/100),IF(AA40<1250001,75000+(AA40-1000000)/5,IF(AA40<1500001,125000+(AA40-1250000)/4,187500+(AA40-1500000)*30/100))))))","v":0}]
[null,"  Income ",null,null,null,null,null," Rs.       "]
[null,"Income from House property",null,null,null,null,null,{"$f":"'new statement'!O23","v":0}]
[null,"Income from other sources INTEREST ON PAY REVISION ARREAR (Interest/ Family pension)",null,null,null,null,null,{"$f":"'new statement (2)'!O24","v":0}]
[null,"Income from business or profession",null,null,null,null,null,{"$f":"'new statement'!O25","v":0}]
[null,"Capital gain income",null,null,null,null,null,{"$f":"'new statement'!O26","v":0}]
[null,"Total       ",null,null,null,null,null,{"$f":"'new statement'!AH258","v":""},null,{"$f":"'new statement (2)'!R26","v":0}]
[null,"8.  Gross total income (6+7)     Rs.  ",null,null,null,null,null,null,null,{"$f":"'new statement (2)'!R27","v":0}]
[null,"9.  Deductions under Chapter  VIA       "]
[null,"        Sections 80C, 80CCC and 80CCD       ",null,null,null,null,null,"Gross Amount",null,"Deductible Amount "]
[null,"   (i) Section 80C     "]
[null,"Providend fund contribution",null,null,null,null,null,{"$f":"'new statement'!O30","v":0}]
[null,"State Life Insurance Policy (SLI)",null,null,null,null,null,{"$f":"'new statement'!O31","v":0}]
[null,"Group Insurance Scheme (GIS)",null,null,null,null,null,{"$f":"'new statement'!O32","v":0}]
[null,"Tax saving Fixed deposits",null,null,null,null,null,{"$f":"'new statement'!O33","v":0}]
[null,"Life Insurence  salary deduction",null,null,null,null,null,{"$f":"'new statement'!O34","v":0}]
[null,"Life Insurence other than salary deduction ",null,null,null,null,null,{"$f":"'new statement'!O35","v":0}]
[null,{"$f":"'det.sal input'!R6&\" +  \"&'det.sal input'!T6","v":"? +  ?"},null,null,null,null,null,{"$f":"'new statement'!O36","v":0}]
[null,"NSC VIII th issue (Nationional Savings certificate)",null,null,null,null,null,{"$f":"'new statement'!O37","v":0}]
[null,"Public Provident Fund (PPF)",null,null,null,null,null,{"$f":"'new statement'!O38","v":0}]
[null,"ULIP/ Tax saving mutual funds",null,null,null,null,null,{"$f":"'new statement'!O39","v":0}]
[null,"Tuition Fees",null,null,null,null,null,{"$f":"'new statement'!O40","v":0}]
[null,"Housing Loan Repayment (PRINCIPAL PORTION ONLY)",null,null,null,null,null,{"$f":"'new statement'!O41","v":0}]
[null,{"$f":"'new statement'!D42","v":0},null,null,null,null,null,{"$f":"'new statement'!O42","v":0}]
[null,"  (ii)   Section 80CCC               ",null,null,null,null,null,{"$f":"'new statement'!O43","v":0}]
[null,"Employee Contrubution to National Pension Scheme - NPS (80CCD)",null,null,null,null,null,{"$f":"'new statement'!O44","v":0}]
[null,"Total investment under  Sec.  80C, 80CCC, 80CCD",null,null,null,null,null,{"$f":"'new statement'!O45","v":0},null,{"$f":"IF(N1=2,0,'new statement (2)'!R45)","v":0}]
[null,"Employee Contrubution to National Pension Scheme  - NPS 80CCD(1B) investment over 1.5 lakh",null,null,null,null,null,{"$f":"'new statement'!O46","v":0},null,{"$f":"IF(N1=2,0,H67)","v":0}]
[null,"Employer's contribution to NPS [Up to 10% Pay+Da+AGPgets excemption u/s Section 80CCD(2)]",null,null,null,null,null,{"$f":"'new statement'!O47","v":0},null,{"$f":"H68","v":0},null,null,null,"NEW RATE tax calculating table actual basis",null,null,null,null,null,null,null,null,null,null,"OLD RATE TAX WITHOUT DEDUCTIONS"]
[null," Investment in Rajiv Gandhi Equity Savings Scheme 80CCG (50% of investment gets excemption.Maximum 25000)",null,null,null,null,null,{"$f":"'new statement'!O48","v":0},null,{"$f":"H69","v":0}]
[null," Other sections (e.g. 80E, 80G etc.) under Chapter VI-A  ",null,null,null,null,null,"Qualifying Amount",null,"Deductible Amount ",null,null,"tax calculation-men","below 60",null,null,null,null,"cenior citizen",null,null,null,"cenior above 80",null,"60 LESS","SENIOR","SUP SENI"]
[null,"Mediclame 80 D",null,null,null,null,null,{"$f":"'new statement'!O49","v":0},null,null,null,null,"aggragate income",{"$f":"J80","v":0},null,null,null,null,{"$f":"J80","v":0},null,null,null,{"$f":"J80","v":0},null,{"$f":"'new statement'!R59","v":0},{"$f":"Y71","v":0},{"$f":"Z71","v":0}]
[null,"Handicaped dependent medical treatment 80 DD ",null,null,null,null,null,{"$f":"'new statement'!O50","v":0},null,null,null,null,"basic deduction",250000,null,null,null,null,300000,null,null,null,500000,null,250000,300000,500000]
[null,"Treatment of chronic diseases 80 DDB",null,null,null,null,null,{"$f":"'new statement'!O51","v":0}]
[null,"Education Loan Interest repayment 80 E",null,null,null,null,null,{"$f":"'new statement'!O52","v":0},null,null,null,null,"balance",{"$f":"IF(N72>N71,0,N71-N72)","v":0},null,null,null,null,{"$f":"IF(S72>S71,0,S71-S72)","v":0},{"$f":"IF(T72>T71,0,T71-T72)","v":0},{"$f":"IF(U72>U71,0,U71-U72)","v":0},{"$f":"IF(V72>V71,0,V71-V72)","v":0},{"$f":"IF(W72>W71,0,W71-W72)","v":0},null,{"$f":"Y71-Y72","v":-250000},{"$f":"Z71-Z72","v":-300000},{"$f":"AA71-AA72","v":-500000}]
[null,"Donation to special funds 80 G including FLOOD RELIEF FUND",null,null,null,null,null,{"$f":"'new statement'!O55","v":0},null,null,null,null,"stage 1 tax",{"$f":"IF(N71>=500000,12500,N74*0.05)","v":0},{"$f":"IF(O71>=500000,30000,O74*0.1)","v":0},{"$f":"IF(P71>=500000,30000,P74*0.1)","v":0},{"$f":"IF(Q71>=500000,30000,Q74*0.1)","v":0},{"$f":"IF(R71>=500000,30000,R74*0.1)","v":0},{"$f":"IF(S71>=500000,10000,S74*0.05)","v":0},null,null,null,{"$f":"IF(W74<=500000,W74*0.2,100000)","v":0},null,{"$f":"IF(Y71>=500000,12500,Y74*0.05)","v":-12500},{"$f":"IF(Z71>=500000,10000,Z74*0.05)","v":-15000},{"$f":"IF(AA74<=500000,AA74*0.2,100000)","v":-100000}]
[null,"Deduction for handicaped employees 80 U",null,null,null,null,null,{"$f":"'new statement'!O56","v":0},null,null,null,null,"stage 2 tax",{"$f":"IF(N71<=500000,0,IF(N71<=1000000,(N71-500000)*0.2,IF(N71>1000000,100000)))","v":0},0,0,0,0,0,null,null,null,{"$f":"IF(W74>500000,(W74-500000)*0.3)","v":false},null,{"$f":"IF(Y71<=500000,0,IF(Y71<=1000000,(Y71-500000)*0.2,IF(Y71>1000000,100000)))","v":0},{"$f":"IF(Z71<=500000,0,IF(Z71<=1000000,(Z71-500000)*0.2,IF(Z71>1000000,100000)))","v":0},{"$f":"IF(AA74>500000,(AA74-500000)*0.3)","v":false}]
[null,null,null,null,null,null,null,null,null,null,null,null,"stage 3 tax",{"$f":"IF(N71<=1000000,0,(N71-1000000)*0.3)","v":0},0,0,0,0,0,0,0,0,null,null,{"$f":"IF(Y71<=1000000,0,(Y71-1000000)*0.3)","v":0},{"$f":"IF(Z71<=1000000,0,(Z71-1000000)*0.3)","v":0}]
[null,null,null,null,null,null,null,{"$f":"'new statement'!O58","v":0},null,null,null,null,"total",{"$f":"N75+N76+N77","v":0},null,null,null,null,{"$f":"S76+S77+S75","v":0},{"$f":"T76+T77+T75","v":0},{"$f":"U76+U77+U75","v":0},{"$f":"V76+V77+V75","v":0},{"$f":"W76+W77+W75","v":0},null,{"$f":"Y75+Y76+Y77","v":-12500},{"$f":"Z76+Z77+Z75","v":-15000},{"$f":"AA76+AA77+AA75","v":-100000}]
[null,"10.  Aggregate of deductible amount (Chapter VI A deduction not allowed in New Regim)",null,null,null,null,null,null,null,0,null,null,"stage 3 tax",{"$f":"IF(N71<=1000000,0,(N71-1000000)*0.3)","v":0},null,null,null,null,null,null,null,null,null,null,{"$f":"IF(Y71<=1000000,0,(Y71-1000000)*0.3)","v":0},{"$f":"IF(Z71<=1000000,0,(Z71-1000000)*0.3)","v":0}]
[null,"11. Total Income or Taxable income (8-10)    ",null,null,null,null,{"$f":"\"( Rs.\"&J47-J79 & \"  Rounded to Ten)\"","v":"( Rs.0  Rounded to Ten)"},null,null,{"$f":"'new statement (2)'!R59","v":0},null,null,"tax=",{"$f":"IF(PERSONAL!H5=\"BELOW 60 YEARS\",' Form 16 NEW REGIME'!N78,IF(PERSONAL!H5=\"60 to 79 Years\",' Form 16 NEW REGIME'!S78,' Form 16 NEW REGIME'!W78))","v":0},null,null,null,null,null,null,null,null,null,null,{"$f":"IF(PERSONAL!H5=\"BELOW 60 YEARS\",' Form 16 NEW REGIME'!Y78,IF(PERSONAL!H5=\"60 to 79 Years\",' Form 16 NEW REGIME'!Z78,' Form 16 NEW REGIME'!AA78))","v":-12500}]
[null,"12. Income Tax (New Regime rate applicable)",null,null,null,null,null,null,null,{"$f":"'new statement (2)'!R60","v":0},null,null,"less tax credit"]
[null,"13. Less Rebate 87A (Maximum of Rs. 12500) available if Point 11 is <500001",null,null,null,null,null,null,null,{"$f":"ROUND(N86,0)","v":0},{"$f":"N86","v":0},null,"Actual tax",{"$f":"ROUND(N80,0)","v":0},null,null,null,null,{"$f":"S78","v":0},null,null,null,{"$f":"W78","v":0}]
[null,"14. Tax after 87A rebate",null,null,null,null,null,null,null,{"$f":"J81-J82","v":0}]
[null,"15. Education cess @ 4% of income tax",null,null,null,null,null,null,null,{"$f":"ROUND((J81-K82)*0.04,0)","v":0},null,null,"10% of taxable inc:",{"$f":"N71*0.1","v":0}]
[null,"16.  Total Tax Payable including cess",null,null,null,null,null,null,null,{"$f":"J81-K82+J84","v":0},null,null,"maximum tax credit:",{"$f":"IF(J81<=0,0,IF(N71<=500000,12500,0))","v":0}]
[null,"17.  Less: Relief under section 89 (attach details)   ",null,null,null,null,null,null,null,{"$f":"ROUND(('new statement (2)'!R65),0)","v":0},null,{"$f":"ROUND(J87,-1)","v":0},"Actual 87a amt",{"$f":"MIN(N82:N85)","v":0}]
[null,"18. Tax payable/ refundable ",null,null,{"$f":"\"[Rounded value to ten is Rs \"&L86&\"]\"","v":"[Rounded value to ten is Rs 0]"},null,null,null,null,{"$f":"L87","v":0},null,{"$f":"IF(J85>J86,J85-J86,0)","v":0}]
[]
[]
[null,"Verification ",null,null,null,null,null,null,null,null,null,null,"Form 16 ഇന്‍കംടാക്സ് വകുപ്പ് തയ്യാറാക്കുന്ന പ്രത്യേക ഫോര്‍മാറ്റിലുള്ള"]
[null,{"$f":"\"I, \"&PERSONAL!H12&\" ,son/daughter of \"&PERSONAL!H13&\" working in the capacity of \"& PERSONAL!H14&\" do hereby certify that\"","v":"I, 0 ,son/daughter of SELECT HRA CLASS working in the capacity of 0 do hereby certify that"},null,null,null,null,null,null,null,null,null,null,"രേഖയാണ്. അതില്‍ മൊത്തത്തില്‍ ഒരു വര്‍ഷത്തില്‍ അടക്കേണ്ട നികുതി "]
[null,"the information given above is true, complete and correct and is based on the books of",null,null,null,null,null,null,null,null,null,null,"മാത്രമേ കാണിക്കുകയുള്ളൂ. അല്ലാതെ ഇതിനകം അടച്ച നികുതിയും "]
[null,"account, documents, TDS statements, and other available records",null,null,null,null,null,null,null,null,null,null,"ബാക്കി അടക്കാനുള്ള നികുതിയും പ്രത്യേകം കാണിക്കുകയില്ല."]
[null,{"$f":"PERSONAL!H11","v":0},null,null,null,null,{"$f":"\"Signature of  \"&PERSONAL!H12","v":"Signature of  0"},null,null,null,null,null,"10 ലേക്ക് ROUND  ചെയ്ത നികുതി സംഖ്യയാണ് ശരിയായ നികുതി. "]
[null,{"$f":"TEXT(TODAY(),\"dd/mm/yyyy\")","v":"05/02/2024"},null,"http://babuvadukkumchery.blogspot..com",null,null,null,null,null,null,null,null,"ROUND ചെയ്യാത്ത തുക ഇവിടെ വെറുതെ  "]
[null,null,null,null,null,null,null,null,null,null,{"$f":"PERSONAL!H14","v":0},null,"അറിവിലേക്കായി നല്‍കീ എന്നേ കരുതേണ്ടൂ "]
[]
[]
[null,null,null,null,null,null,null,null,null,null,null,null,null,"tax calculating table accrual basis NEW REGIME"]
[null,null,null,null,null,null,null,null,null,null,null,null,"tax calculation-men","below 60",null,null,null,null,"cenior citizen",null,null,null,"cenior above 80"]
[null,null,null,null,null,null,null,null,null,null,null,null,"aggragate income",{"$f":"'Form 10E NEW REG'!H33","v":0},null,null,null,null,{"$f":"N101","v":0},null,null,null,{"$f":"N101","v":0}]
[]
[null,null,null,null,null,null,null,null,null,null,null,null,"TAX NEW REGIME",{"$f":"IF(N101<250001,0,IF(N101<500001,( N101-250000)/20,IF(N101<750001,(12500+(N101-500000)/10),IF(N101<1000001,(37500+(N101-750000)*15/100),IF(N101<1250001,75000+(N101-1000000)/5,IF(N101<1500001,125000+(N101-1250000)/4,187500+(N101-1500000)*30/100))))))","v":0},null,null,null,null,"NOT APPLI",null,null,null,"NOT APPLI"]
[]
[]
[]
[]
[]
[null,null,null,null,null,null,null,null,null,null,null,null,null,{"$f":"N106+N107+N108","v":0},null,null,null,null,{"$f":"S107+S108+S106","v":0},{"$f":"T107+T108+T106","v":0},{"$f":"U107+U108+U106","v":0},{"$f":"V107+V108+V106","v":0},{"$f":"W107+W108+W106","v":0}]
[]
[]
[null,null,null,null,null,null,null,null,null,{"$f":"N111","v":0},null,null,"less tax credit 87 A",{"$f":"IF(N103<=0,0,IF(N101<=500000,12500,0))","v":0}]
[null,null,null,null,null,null,null,null,null,null,null,null,"Mini of tax/ rebate 87 A",{"$f":"MIN(N112,N103)","v":0},null,null,null,null,{"$f":"S109","v":0},null,null,null,{"$f":"W109","v":0}]
[]
[null,null,null,null,null,null,null,null,null,null,null,null,"TAX AFTER 87 A =",{"$f":"N103-N113","v":0}]
[null,null,null,null,null,null,null,null,null,null,null,null,"Tax inclu. Edu cess 4%",{"$f":"ROUND((N115*104%),0)","v":0}]
[null,null,null,null,null,null,null,null,null,null,null,null,"Actual 87a amt",{"$f":"MIN(N113:N116)","v":0}]

{"sheet":"ARREAR SPLIT","index":15,"n_rows":165,"n_cols":24,"rows_kept":165,"cut":false,"hidden":true,"merged":[[1,1,1,13],[0,1,0,13],[31,14,31,15],[35,2,35,5],[33,0,33,11],[33,13,34,13],[34,2,34,11],[34,14,34,15],[5,1,5,10],[24,1,24,11],[23,1,23,10],[7,1,7,12],[11,1,11,12],[12,1,12,12],[28,1,28,11],[20,11,20,19],[90,2,91,17],[92,2,92,17],[36,2,36,11],[78,0,78,18],[79,0,79,18],[82,2,82,11],[90,18,91,18],[59,3,59,16],[86,3,86,11],[59,17,60,17],[59,18,60,18],[41,3,41,16],[46,3,46,16],[41,17,42,17],[41,18,42,18],[46,18,47,18],[46,17,47,17],[16,1,16,12],[6,1,6,12],[20,1,20,10],[17,1,17,12]]}
[null,{"$f":"\"10 -E CALCULATION of \"&PERSONAL!H4","v":"10 -E CALCULATION of "},null,null,null,null,null,null,null,null,null,null,null,null,null,null,null,"Now Relief amount is",{"$f":"'Form 10E'!H40","v":0},{"$f":"'Form 10E NEW REG'!H40","v":0},null,null,null,"YES"]
[1,"Caution...!  Just place mouse pointer on this lines to read an important warning.  തുടരുന്നതിന് മുന്‍പായി ഈ വരികളില്‍ മൗസ് പൊയിന്‍റെര്‍ വച്ച് നിര്‍ദ്ദേശങ്ങള്‍ വായിക്കുക"]
[null,null,{"$f":"\"1. Total of arrears credited to PF [including interest]\"","v":"1. Total of arrears credited to PF [including interest]"},null,null,null,null,null,null,null,{"$f":"'det.sal input'!C21","v":0},null,null,{"$f":"'det.sal input'!C21","v":0},null,null,null,null,null,null,"Male"]
[null,null,"2. Total of arrears as Cash receipt / credited to NPS  [fully or partially] including DEFERRED SALARY & arrear interest",null,null,null,null,null,null,null,{"$f":"'det.sal input'!C22+'det.sal input'!C25","v":0},null,null,{"$f":"K4","v":0},null,null,null,null,null,null,"Female"]
[null,null,{"$f":"\"Total arrears [excluding interest Rs. \"&'det.sal input'!W27&\"] 1+2  minus  Interest\"","v":"Total arrears [excluding interest Rs. ] 1+2  minus  Interest"},null,null,null,null,null,"പലിശ കിഴിച്ച ശേഷം ",null,{"$f":"K3+K4-'det.sal input'!W27","v":0},{"$f":"K5-SUM(D39:K39)","v":-3000},null,{"$f":"K3+K4-'det.sal input'!W27","v":0},null,null,null,null,null,null,"Senior Citizen (65-79)"]
[null,{"$f":"\"show split up of the above arrear Rs. \"&N5&\" in the following tables 1,2,3\"&\" [മുകളില്‍ കാണുന്ന കുടിശ്ശിക സംഖ്യ ചുവടെ കാണുന്ന 1,2,3 പട്ടികകളില്‍ വര്ഷം തിരിച്ചു നല്‍കുക. കൂടിശികയിൽ ഉൾപ്പെട്ട 2021-22 വർഷത്തെ തുകകൾ എഴുതേണ്ടതില്ല. അവ തനിയെ പരിഗണിക്കപ്പെടും ] \"","v":"show split up of the above arrear Rs. 0 in the following tables 1,2,3 [മുകളില്‍ കാണുന്ന കുടിശ്ശിക സംഖ്യ ചുവടെ കാണുന്ന 1,2,3 പട്ടികകളില്‍ വര്ഷം തിരിച്ചു നല്‍കുക. കൂടിശികയിൽ ഉൾപ്പെട്ട 2021-22 വർഷത്തെ തുകകൾ എഴുതേണ്ടതില്ല. അവ തനിയെ പരിഗണിക്കപ്പെടും ] "},null,null,null,null,null,null,null,null,null,null,null,null,null,null,null,null,null,null,"Senior Citizen (above 80)"]
[null,"PAY REVISION ARREAR DETAILS ORIGINALLY RECEIVED ONLY [IF ANY] (Excluding Interest) [Table 1]"]
[null,"Show yearly split up of amounts of different FINANCIAL YEARS (ഇവിടെ പേ റിവിഷന്‍ കുടിശികയുടെ വാര്‍ഷീക തുക ഈ വര്‍ഷത്തില്‍ യഥാര്‍ത്ഥത്തില്‍ കിട്ടിയത് മാത്രം സാമ്പത്തീക വര്ഷം തിരിച്ചു എഴുതുക) "]
[null,"2009-10","2010-11","2011-12","2012-13","2013-14","2014-15","2015-16","2016-17","2017-18","2018-19","2019-20","2020-21","TOTAL"]
[null,null,null,null,null,null,null,null,null,null,null,null,null,{"$f":"SUM(B10:M10)","v":0}]
[null,{"$f":"IF(N10>1,\"Warning - Fill the Table 4, other wise calculations will be false- Table 4 നിര്‍ബന്ധമായും പൂരിപ്പിക്കുക, അല്ലാത്തപക്ഷം തെറ്റായ വിവരം നല്‍കും \",\"\")","v":""}]
[null,"DA ARREAR DETAILS  [Table 2]"]
[null,"Show yearly split up of amounts of different FINANCIAL YEARS  (ഇവിടെ DA  കുടിശികയുടെ വാര്‍ഷീക തുക ഈ വര്‍ഷത്തില്‍ യഥാര്‍ത്ഥത്തില്‍ കിട്ടിയത് മാത്രം സാമ്പത്തീക വര്ഷം തിരിച്ചു എഴുതുക) "]
[null,"2009-10","2010-11","2011-12","2012-13","2013-14","2014-15","2015-16","2016-17","2017-18","2018-19","2019-20","2020-21","TOTAL"]
[null,null,null,null,null,null,null,null,null,null,null,null,null,{"$f":"SUM(B15:M15)","v":0}]
[null,{"$f":"IF(N15>1,\"Warning - Fill the Table 4, other wise calculations will be false- Table 4 നിര്‍ബന്ധമായും പൂരിപ്പിക്കുക, അല്ലാത്തപക്ഷം തെറ്റായ വിവരം നല്‍കും \",\"\")","v":""}]
[null,"TOTAL   ARREAR DETAILS  "]
[null,"Show yearly split up of amounts of different FINANCIAL YEARS  (ശമ്പള കുടിശികയുടെ വാര്‍ഷീക തുക ഈ വര്‍ഷത്തില്‍ യഥാര്‍ത്ഥത്തില്‍ കിട്ടിയത് മാത്രം സാമ്പത്തീക വര്ഷം തിരിച്ചു എഴുതുക) "]
[null,"2009-10","2010-11","2011-12","2012-13","2013-14","2014-15","2015-16","2016-17","2017-18","2018-19","2019-20","2020-21","TOTAL"]
[null,{"$f":"'ARR MONH SPLIT'!C63","v":0},{"$f":"'ARR MONH SPLIT'!E63","v":0},{"$f":"'ARR MONH SPLIT'!G63","v":0},{"$f":"'ARR MONH SPLIT'!I63","v":0},{"$f":"'ARR MONH SPLIT'!K63","v":0},{"$f":"'ARR MONH SPLIT'!M63","v":0},{"$f":"'ARR MONH SPLIT'!O63","v":0},{"$f":"'ARR MONH SPLIT'!Q63","v":0},{"$f":"'ARR MONH SPLIT'!S63","v":0},{"$f":"'ARR MONH SPLIT'!U63","v":0},{"$f":"'ARR MONH SPLIT'!W63","v":0},{"$f":"'ARR MONH SPLIT'!Y63","v":0},{"$f":"SUM(B20:M20)","v":0}]
[null,"Total arrear details (Pay Revision + DA+Salary)",null,null,null,null,null,null,null,null,null,{"$f":"IF((N10+N15+N20)>N5,\"Caution- Error, Split amount should not be more than total arrear. Please check\",\"\")","v":""}]
[null,{"$f":"B10+B15+B20","v":0},{"$f":"C10+C15+C20","v":0},0,0,0,0,0,0,0,0,0,0,{"$f":"'ARR MONH SPLIT'!AA63","v":0},null,null,null,{"$f":"N5-N22","v":0}]
[null,{"$f":"\"Out of the total amount of arrear Rs.  \"&K5&\", an amount of Rs.\"&R22&\" is related with the current financial year\"","v":"Out of the total amount of arrear Rs.  0, an amount of Rs.0 is related with the current financial year"},null,null,null,null,null,null,null,null,null,null,null,{"$f":"K5-N22","v":0}]
[null,"TAXABLE INCOME OF DIFFERENT FINANCIAL YEARS  ",null,null,null,null,null,null,null,null,null,null,null,null,null,"Male"]
[null,"Show yealy taxable income details below the cells coloured RED. If no income, write 0 -  CAUTION  ഇവിടെ മൌസ് വച്ച് വിശദാംശങ്ങള്‍ വായിക്കുക__ചുവന്ന നിറത്തില്‍ പിൻ വർഷങ്ങൾ രേഖപ്പെടുത്തി  കാണുന്ന ബോക്സിനുതാഴെ വിവരം നിര്‍ബന്ധമായും നല്‍കണം. ഒരു കാരണവശാലും കുടിശിക ലഭിച്ചിട്ടുള്ള ഒരു വർഷവും ഒഴിവാക്കരുത് വരുമാനമില്ലാത്തവര്‍ 0 (zero) നല്‍കാം  ",null,null,null,null,null,null,null,null,null,null,null,{"$f":"N105","v":"Male"},null,"Female"]
[null,{"$f":"IF(B22>0,\"2009-10\",\"Skip this year\")","v":"Skip this year"},{"$f":"IF(C22>0,\"2010-11\",\"Skip this year\")","v":"Skip this year"},{"$f":"IF(D22>0,\"2011-12\",\"Skip this year\")","v":"Skip this year"},{"$f":"IF(E22>0,\"2012-13\",\"Skip this year\")","v":"Skip this year"},{"$f":"IF(F22>0,\"2013-14\",\"Skip this year\")","v":"Skip this year"},{"$f":"IF(G22>0,\"2014-15\",\"Skip this year\")","v":"Skip this year"},{"$f":"IF(H22>0,\"2015-16\",\"Skip this year\")","v":"Skip this year"},{"$f":"IF(I22>0,\"2016-17\",\"Skip this year\")","v":"Skip this year"},{"$f":"IF(J22>0,\"2017-18\",\"Skip this year\")","v":"Skip this year"},{"$f":"IF(K22>0,\"2018-19\",\"Skip this year\")","v":"Skip this year"},{"$f":"IF(L22>0,\"2019-20\",\"Skip this year\")","v":"Skip this year"},"2020-21","2021-22",null,"Senior Citizen (65-79)",null,null,null,null,null,"OLD REGIME"]
[null,null,null,null,null,null,null,null,null,null,null,null,null,2,null,"Senior Citizen (above 80)",null,{"$f":"SUM(B27:N27)","v":2},null,null,null,"NEW REGIME"]
[]
[null,"Please check your 2020-21, 2021-22 FY year's tax statement, The tax rate option selected may be OLD REGIME or NEW REGIME. Choose the correct  option on the right side  by clicking  the COFFEE coloured കഴിഞ്ഞ രണ്ടു  Financial year വർഷത്തെ നികുതി സ്റ്റേറ്റ്മെൻറ് പരിശോധിച്ച് താങ്കൾ OLD REGIME/ NEW REGIME എന്നിവയിൽ ഏത് നിരക്കിലാണ് നികുതി കണ്ടതെന്ന് നോക്കി വലതു വശത്ത് കാണുന്ന ഓപ്ഷനിൽ ക്ലിക് ചെയ്തു ശരിയായത് സെലെക്റ്റ് ചെയ്യുക ",null,null,null,null,null,null,null,null,null,null,"OLD REGIME","OLD REGIME"]
[null,{"$f":"IF(AND(N27<1,B22>1),\"Fill the above Table 4. If income relating to the respective financial years is NIL, put zero (0)\",\"\")","v":""}]
[]
[null,null,{"$f":"\"To prepare 10 E form, yearly split up of the Rs. \"&K5&\" is required. Type the arrear monthly split up in the tables shown below 1a/1b/1c\"","v":"To prepare 10 E form, yearly split up of the Rs. 0 is required. Type the arrear monthly split up in the tables shown below 1a/1b/1c"},null,null,null,null,null,null,null,null,null,null,null,"Category",null,"(Female & senior citizen should change category)"]
[]
["If you have mannualy calculated yearly split up of the amount, select  YES, otherwise select  NO",null,null,null,null,null,null,null,null,null,null,null,null,"YES","Senior Citizen (65-79)"]
[null,null,"Select the category you belongs to (പുരുഷനോ സ്ത്രീയോ, തിരഞ്ഞെടുക്കുക) ",null,null,null,null,null,null,null,null,null,null,null,{"$f":"N25","v":"Male"}]
[null,null,{"$f":"IF(N34=\"YES\",\"CLICK BUTTON 1 TO CONTINUE\",\"CLICK BUTTON 2 TO CONTINUE\")","v":"CLICK BUTTON 1 TO CONTINUE"}]
[1,null,{"$f":"\"Mannually calculated yearly split up of ALL arrear Rs.  \"&K5&\" is to be shown below\"","v":"Mannually calculated yearly split up of ALL arrear Rs.  0 is to be shown below"}]
["Year","2018-19","2017-18","2016-17","2015-16","2014-15","2013-14","2012-13","2011-12","2010-11","2009-10","Year",null,{"$f":"IF(SUM(D39:K39)<=K5,\"\",\"ERROR ! Total of arrear split up should not be more than \"&K5)","v":"ERROR ! Total of arrear split up should not be more than 0"}]
["Arrear Rs.",1500,1000,3000,null,null,null,null,null,null,null,"Arrear Rs.",null,null,null,null,null,null,{"$f":"SUM(B39:K39)","v":5500}]
[]
[]
["[1a]",null,null,"TOTAL PAY REVISION ARREARS DRAWN THIS YEAR- MONTHLY SPLIT UP (Excluding interest) - Rupees (ഈ വര്ഷം വാങ്ങിയത് മാത്രം)",null,null,null,null,null,null,null,null,null,null,null,null,null,"Surrender","Yearly total Rs."]
[null,null,null,null,"MARCH","APRIL","MAY","JUNE","JULY","AUG","SEPT","OCT",null,"NOV","DEC","JAN","FEB"]
[null,null,null,"2014-15",null,null,null,null,null,null,null,null,null,null,null,null,null,null,{"$f":"SUM(I44:R44)","v":0},{"$f":"S44+S45","v":0}]
[null,null,null,"2015-16",null,null,null,null,null,null,null,null,null,null,null,null,null,null,{"$f":"SUM(E45:R45)","v":0},{"$f":"\"Total Rs. \"&S44+S45","v":"Total Rs. 0"}]
[]
["[1b]",null,null,"DA ARREAR MONTHLY SPLIT UP - Rupees",null,null,null,null,null,null,null,null,null,null,null,null,null,"Surrender","Yearly total Rs."]
[null,null,null,"Year","MARCH","APRIL","MAY","JUNE","JULY","AUG","SEPT","OCT",null,"NOV","DEC","JAN","FEB"]
[null,null,null,"2009-10",null,null,null,null,null,null,null,null,null,null,null,null,null,null,{"$f":"SUM(E49:R49)","v":0}]
[null,null,null,"2010-11",null,null,null,null,null,null,null,null,null,null,null,null,null,null,{"$f":"SUM(E50:R50)","v":0}]
[null,null,null,"2011-12",null,null,null,null,null,null,null,null,null,null,null,null,null,null,0]
[null,null,null,"2012-13",null,null,null,null,null,null,null,null,null,null,null,null,null,null,0]
[null,null,null,"2013-14",null,null,null,null,null,null,null,null,null,null,null,null,null,null,0]
[null,null,null,"2014-15",null,null,null,null,null,null,null,null,null,null,null,null,null,null,0]
[null,null,null,"2015-16",null,null,null,null,null,null,null,null,null,null,null,null,null,null,0,{"$f":"SUM(S49:S56)","v":0}]
[null,null,null,"2016-17",null,null,null,null,null,null,null,null,null,null,null,null,null,null,0,{"$f":"\"Total Rs. \"&SUM(S49:S57)","v":"Total Rs. 0"}]
[null,null,null,"2017-18",null,null,null,null,null,null,null,null,null,null,null,null,null,null,0]
[null,null,null,"2018-19"]
[]
["[1c]",null,null,"PAY [salary] ARREAR (OR ANY OTHER ARREAR) MONTHLY SPLIT UP - Rupees",null,null,null,null,null,null,null,null,null,null,null,null,null,"Surrender","Yearly total Rs. "]
[null,null,null,"Year","MARCH","APRIL","MAY","JUNE","JULY","AUG","SEPT","OCT",null,"NOV","DEC","JAN","FEB"]
[null,null,null,"2009-10",null,null,null,null,null,null,null,null,null,null,null,null,null,null,{"$f":"SUM(E62:R62)","v":0}]
[null,null,null,"2010-11",null,null,null,null,null,null,null,null,null,null,null,null,null,null,{"$f":"SUM(E63:R63)","v":0}]
[null,null,null,"2011-12",null,null,null,null,null,null,null,null,null,null,null,null,null,null,0]
[null,null,null,"2012-13",null,null,null,null,null,null,null,null,null,null,null,null,null,null,0]
[null,null,null,"2013-14",null,null,null,null,null,null,null,null,null,null,null,null,null,null,0]
[null,null,null,"2014-15",null,null,null,null,null,null,null,null,null,null,null,null,null,null,0]
[null,null,null,"2015-16",null,null,null,null,null,null,null,null,null,null,null,null,null,null,0,{"$f":"SUM(S62:S69)","v":0}]
[null,null,null,"2016-17",null,null,null,null,null,null,null,null,null,null,null,null,null,null,0,{"$f":"\"Total Rs. \"&SUM(S62:S70)","v":"Total Rs. 0"}]
[null,null,null,"2017-18",null,null,null,null,null,null,null,null,null,null,null,null,null,null,0]
[null,null,null,"2018-19"]
[null,null,null,"monthly cosolidated values"]
["Year","2018-19","2017-18","2016-17","2015-16","2014-15","2013-14","2012-13","2011-12","2010-11","2009-10"]
["Arrear Rs.",{"$f":"S71+S58","v":0},{"$f":"S70+S57","v":0},{"$f":"S69+S56","v":0},{"$f":"S68+S55+S45","v":0},{"$f":"S67+S54+S44","v":0},{"$f":"S66+S53","v":0},{"$f":"S65+S52","v":0},{"$f":"S64+S51","v":0},{"$f":"S63+S50","v":0},{"$f":"S62+S49","v":0}]
[null,null,null,"applicable values for calculation according to option yes or no"]
["Year","2018-19","2017-18","2016-17","2015-16","2014-15","2013-14","2012-13","2011-12","2010-11","2009-10"]
["Arrear Rs.",{"$f":"IF($N$34=\"yes\",B39,B74)","v":1500},1000,3000,0,0,0,0,0,0,0]
[]
["Show TAXABLE INCOME (TOTAL INCOME) of previous years in respective fields (പിന്‍ വര്‍ഷങ്ങളിലെ TAXABLE വരുമാനം കാണിക്കുക) "]
["What is Taxable Income of previous year..?  You must read it. Just place mouse pointer on this lines and read. പിന്‍കാല ടാക്സബിള്‍ ഇന്‍കം എന്നാല്‍ എന്ത്...? ഈ വരികളില്‍ മൗസ് പൊയിന്റര്‍ വച്ച് നിര്‍ബന്ധമായും വായിക്കുക "]
[]
[]
[2,null," Taxable Income of Financial Years before this arrear (may be zero for a new salary recipient)",null,null,null,null,null,null,null,null,null,null,{"$f":"IF((S39+T44+T55+T68)<=K5,\"\",\"ERROR ! Arrear split up total should not be more than \"&K5)","v":"ERROR ! Arrear split up total should not be more than 0"}]
["Year",{"$f":"IF(B77=0,\"Not needed\",\"2018-19\")","v":"2018-19"},{"$f":"IF(C77=0,\"Not needed\",\"2017-18\")","v":"2017-18"},{"$f":"IF(D77+S69+S56=0,\"Not needed\",\"2016-17\")","v":"2016-17"},{"$f":"IF(E77+S55+S68+S45=0,\"Not needed\",\"2015-16 \")","v":"Not needed"},{"$f":"IF(F77+S67+S54+S44=0,\"Not needed\",\"2014-15 \")","v":"Not needed"},{"$f":"IF(G77+S53+S66=0,\"Not needed\",\"2013-14 \")","v":"Not needed"},{"$f":"IF(H77+S52+S65=0,\"Not needed\",\"2012-13\")","v":"Not needed"},{"$f":"IF(I77+S51+S64=0,\"Not needed\",\"2011-12 \")","v":"Not needed"},{"$f":"IF(J77+S50+S63=0,\"Not needed\",\"2010-11\")","v":"Not needed"},{"$f":"IF(K77+S49+S62=0,\"Not needed\",\"2009-10\")","v":"Not needed"},"Year"]
["Income Rs.",1,2,3,4,5,6,7,8,9,10,"Income Rs."]
[]
[3,null,null,{"$f":"IF(SUM(D77:K77)=0,\"You have to skip this field\",\"Show chapter VI A deductions of concerned years [if any] only if it is demanded by the software\")","v":"Show chapter VI A deductions of concerned years [if any] only if it is demanded by the software"}]
["Year",{"$f":"IF(B85=0,B84,\"Never show\")","v":"Never show"},{"$f":"IF(C85=0,C84,\"Never show\")","v":"Never show"},{"$f":"IF(D85=0,D84,\"Never show\")","v":"Never show"},"Never show","Never show","Never show","Never show","Never show","Never show","Never show","Year"]
["Income Rs.",null,null,null,null,null,null,null,null,null,null,"Income Rs."]
[null,null,null,null,null,null,null,null,null,null,null,null,null,null,null,null,null,null,"Relief Rs."]
[null,null,{"$f":"IF(K5=\"\",\"\",IF('arrear det'!K100>1,\"താങ്കള്‍ 10 E ഫോം മാനുവല്‍ ആയി തയ്യാറാക്കുന്നതിനുള്ള ഓപ്ഷന്‍ സ്വീകരിച്ചതിനാല്‍ മുകളിലുള്ള തുകകള്‍ പരിഗണിക്കാതെ താങ്കള്‍ എഴുതിച്ചേര്‍ത്ത തുക പരിഗണിച്ചിരിക്കുന്നു Click Continue 2\",IF(D85+E85+F85+G85+H85+I85+J85+K85=0,\"Fill details of second row. If you are receiving salary income  first time during this year, values in fifth row will be zero താങ്കള്‍ രണ്ടാം റോ പൂരിപ്പിചിട്ടില്ല, ഇപ്പോള്‍ ആദ്യമായി വരുമാനം നേടുന്നവര്‍ അവിടെ  പൂജ്യം നല്‍കാം \",\"1,2 ചോദ്യങ്ങള്‍ക്ക് വിവരങ്ങള്‍ പൂര്‍ണ്ണമായി നല്‍കിയാല്‍ താങ്കളുടെ ഇളവു വലത്തുവശത്തു കാണുംവിധമാണ്. ‍If your data entry is over, your relief amount is shown in right side. Click Continue 1 \")))","v":"1,2 ചോദ്യങ്ങള്‍ക്ക് വിവരങ്ങള്‍ പൂര്‍ണ്ണമായി നല്‍കിയാല്‍ താങ്കളുടെ ഇളവു വലത്തുവശത്തു കാണുംവിധമാണ്. ‍If your data entry is over, your relief amount is shown in right side. Click Continue 1 "},null,null,null,null,null,null,null,null,null,null,null,null,null,null,null,{"$f":"IF('arrear det'!K100>1,'arrear det'!K100,'Form 10E'!H40)","v":0}]
[]
[null,null,{"$f":"IF('arrear det'!K100>1,\"താങ്കള്‍ 10 E ഫോം മാനുവല്‍ ആയി തയ്യാറാക്കുന്നതിനുള്ള ഓപ്ഷന്‍ സ്വീകരിച്ചതിനാല്‍ ഈ സംവിധാനത്തില്‍ നിന്നും ലഭിക്കുന്ന ഫോം 10 E സെറ്റ് ഉപയോഗിക്കരുത് എന്നാല്‍ Incometax Statement, Form 16 പ്രിന്റുകള്‍ പരിഗണിക്കാവുന്നതാണ്\",IF(S91=0,\"Sorry, you cannot claim for Relief, You are not needed to take printouts of Form 10E\",\" If you filled row number 2, you are benifited with following relief. Nothing more to do, Click GO BACK button, and print meunu 8. If you are benifited, then only you have to submit tax satements of previous years, Form 10 E set additionally\"))","v":"Sorry, you cannot claim for Relief, You are not needed to take printouts of Form 10E"}]
[]
[]
[]
[]
[]
[null,null,"Sorry , 10 E Calculation facility will be provided in this software during  Dec 2019"]
[null,null,"Kindly download the revised version during December"]
[null,null,"To download the revised version, visit: babuvadukkumchery.blogspot.in"]
[]
[]
[]
[null,null,null,null,null,null,null,null,null,null,null,null,"Now select whether you are MALE or FEMALE  from the list - പുരുഷനാണോ സ്ത്രീയാണോ എന്നു തെരഞ്ഞെടുക്കുക ","Male"]
[]
[null,null,null,null,null,null,null,null,null,"If your data entry is over, click the green button on the right side to view / Print 10 E form sets -",{"$f":"print!L9","v":0},null,null,{"$f":"INVEST!L3","v":0}]
[null,null,null,null,null,null,null,null,null,null,null,null,{"$f":" \"Dear \"&PERSONAL!H4&\", \"&\"balacne of tax payable after deducting the relief for arrear if any, is\"","v":"Dear , balacne of tax payable after deducting the relief for arrear if any, is"},{"$f":"\" Rs. \"&INVEST!N1&INVEST!O1","v":" Rs. 0 (Refund)"}]
[null,null,null,null,null,null,null,null,null,null,null,null,null,{"$f":"IF(R27=0,\"Caution ! You must fill the taxable income below the ALL red coloured previous financial years shown above\",\"\")","v":""}]
[]
[]
[]
[]
[]
[]
[]
[]
[]
[]
[]
[]
[]
[]
[]
[]
[]
[]
[]
[]
[]
[]
[]
[]
[]
[]
[]
[]
[]
[]
[]
[]
[]
[]
[]
[]
[]
[]
[]
[]
[]
[]
[]
[]
[]
[]
[]
[]
[]
[null,null,"Sorry,"]
[null,null,"At present the facility is not provided in the software. If the mannually calculated 89(1) Relief amount is available,"]
[null,null,"You can type the value in box provided below this line. The facility will be provided later while updating the App"]
[null,null,"നിലവിൽ ഈ സൌകര്യം ലഭ്യമാക്കിയിട്ടില്ല. മാന്വൽ ആയി കണക്കാക്കിയ റിലീഫ്  തുക അറിയാമെങ്കിൽ "]
[null,null,"ചുവടെ നല്കാം. 1 0 E സൌകര്യം ഭാവിയിൽ ലഭ്യമാക്കും "]
[]
[null,null,"89 (1) Relief amount manually calculated by me is Rs. "]

{"sheet":"MEDI INS OTHER DED","index":16,"n_rows":17,"n_cols":19,"rows_kept":17,"cut":false,"hidden":false,"merged":[[11,19,14,21],[14,3,14,14],[15,3,15,15],[8,3,8,14],[11,3,11,14],[13,3,13,14],[7,17,9,17],[1,2,1,16],[7,16,9,16],[2,2,2,14],[12,3,12,14],[10,2,10,14],[11,16,13,16],[9,3,9,14],[3,17,3,20],[3,3,3,14],[4,3,4,14],[5,3,5,14],[7,3,7,14],[6,2,6,14],[4,17,4,20]]}
[null,null,"Page 5"]
[null,null,{"$f":"\"MEDICAL INSURANCE/ EXPENSE  \"&\"details of \"&PERSONAL!H4","v":"MEDICAL INSURANCE/ EXPENSE  details of "},null,null,null,null,null,null,null,null,null,null,null,null,null,null,{"$f":"PERSONAL!H5","v":"Below 60 Years"}]
[null,null,"Fill all the details very carefully-മുഴുവൻ വിവരങ്ങളും നിർബന്ധമായും പൂരിപ്പിക്കുക ",null,null,null,null,null,null,null,null,null,null,null,null,"Details ","Eligible amount"]
[null,null,1,"Have you / family (excluding parents) taken a medical insurance policy other than Medicep (താങ്കളോ,  കുടുംബമോ (രക്ഷിതാക്കൾ ഒഴികെ)  മെഡിസെപിനു പുറമെ medical insurance policy എടുത്തിട്ടുണ്ടോ)"]
[null,null,1,"മാതാ പിതാക്കളുടെ പേരിൽ medical Insurance policy കൾ ഏടുത്തിട്ടുണ്ടോ",null,null,null,null,null,null,null,null,null,null,null,null,null,{"$f":"IF($P$5=\"\",\"Caution : Kindly answer questions 1; otherwise the statemet may show wrong result\",IF($P$6=\"\",\"Caution : Kindly answer questions 1; otherwise the statemet may show wrong result\",\"\"))","v":"Caution : Kindly answer questions 1; otherwise the statemet may show wrong result"}]
[null,null,2,"മാതാപിതാക്കൾ senior Citizen വിഭാഗത്തിൽപെടുന്നുവോ",null,null,null,null,null,null,null,null,null,null,null,null,null,{"$f":"IF(P6=\"yes\",50000,25000)","v":25000}]
[null,null,"Medical insurance  details of your family EXCLUDING PARENTS"]
[null,null,3,"Medisep അല്ലാതെ, സ്വന്തം / ഇണ / മക്കൾ എന്നിവരുടെ പേരിൽ എടുത്ത medical insurance policy യുടെ പ്രീമിയം തുക (excluding expenditure for parents)",null,null,null,null,null,null,null,null,null,null,null,null,{"$f":"IF(R2=\"below 60 years\",MIN(R8,25000),MIN(R8,50000))","v":0},{"$f":"P8+P9+P10","v":0}]
[null,null,4,"Preventive medical checkup നായി self / ഇണ/മക്കൾ  എന്നിവരുടെ പേരിൽ തുക ചെലവാക്കിയെങ്കിൽ ആ തുക എത്ര- Maximum 5000 is allowed- (Type expenditure excluding parents)",null,null,null,null,null,null,null,null,null,null,null,null,null,null,{"$f":"IF(R2=\"below 60 years\",25000,50000)","v":25000}]
[null,null,"5 *","Salary details ൽ നൽകിയ വിവരപ്രകാരം Medisep ൽ അടച്ച തുക (Already entered by you in salary deduction field)",null,null,null,null,null,null,null,null,null,null,null,{"$f":"'det.sal input'!V26","v":0}]
[null,null,"Medical Insurance details of PARENTS"]
[null,null,6,{"$f":"IF(P5=\"No\",\"You can skip this question ഈ ചോദ്യം അവഗണിക്കുക\",\"Medisep അല്ലാതെ, മാതാപിതാക്കളുടെ പേരിൽ എടുത്ത medical insurance പോളിസിയുടെ മാത്രം പ്രീമിയം തുക \" )","v":"Medisep അല്ലാതെ, മാതാപിതാക്കളുടെ പേരിൽ എടുത്ത medical insurance പോളിസിയുടെ മാത്രം പ്രീമിയം തുക "},null,null,null,null,null,null,null,null,null,null,null,null,{"$f":"MIN(P12+P13+P14,R12)","v":0},{"$f":"IF(P6=\"\",25000,IF(P6=\"no\",25000,IF(P6=\"yes\",50000,25000)))","v":25000}]
[null,null,7,"Preventive medical checkup നായി മാതാ പിതാക്കളുടെ  പേരിൽ തുക ചെലവാക്കിയെങ്കിൽ ആ തുക എത്ര- Maximum 5000 is allowed"]
[null,null,8,"Medical expense incurred for SENIOR CITIZEN PARENTS, paid other than by CASH, with all bills [ costs like medical consultations, impairment aids, medicines, hospitalisation etc.]  "]
[null,null,9,"Total amount for Medical insurance",null,null,null,null,null,null,null,null,null,null,null,{"$f":"SUM(P8,P9,P10,P12,P13,P14)","v":0},{"$f":"SUM(Q8:Q12)","v":0},{"$f":"IF(R2=\"Below 60 years\",50000,100000)","v":50000}]
[null,null,10,"Total Eligible amount under Section 80 D - Medical insurance, by considering all Medical insurances",null,null,null,null,null,null,null,null,null,null,null,null,{"$f":"MIN(Q15,R16)","v":0},{"$f":"IF(P5=\"no\",50000,IF(P5=\"\",50000,IF(P6=\"no\",50000,IF(P6=\"yes\",100000,IF(P6=\"\",50000)))))","v":50000}]
[null,null,"*  You can't type medisep value in sl no 5 row, for that click go back, and enter values in monthly salary/ deduction typing field- medisep column"]

{"sheet":"DA ALTER","index":17,"n_rows":32,"n_cols":23,"rows_kept":32,"cut":false,"hidden":false,"merged":[[2,2,2,11],[4,3,5,3],[4,1,5,1],[4,2,5,2],[4,4,5,4],[4,5,5,5],[4,7,5,7],[4,8,5,8]]}
[]
[]
[]
[]
[null,"Months  Receipts","BASIC PAY","AGP *","DA%","DA",null,"HRA auto generated","To change HRA value, Type your Original HRA"]
[]
[null,{"$f":"'new statement'!B79:C79","v":"March-2023"},{"$f":"'det.sal input'!C8","v":0},{"$f":"'det.sal input'!D8","v":0},7.0000000000000007E-2,{"$f":"B21","v":0},null,{"$f":"W21","v":0}]
[null,{"$f":"'new statement'!B80:C80","v":"April"},{"$f":"'det.sal input'!C9","v":0},{"$f":"'det.sal input'!D9","v":0},7.0000000000000007E-2,{"$f":"B22","v":0},null,{"$f":"W22","v":0}]
[null,{"$f":"'new statement'!B81:C81","v":"May"},{"$f":"'det.sal input'!C10","v":0},{"$f":"'det.sal input'!D10","v":0},7.0000000000000007E-2,0,null,0]
[null,{"$f":"'new statement'!B82:C82","v":"June"},{"$f":"'det.sal input'!C11","v":0},{"$f":"'det.sal input'!D11","v":0},7.0000000000000007E-2,0,null,0]
[null,{"$f":"'new statement'!B83:C83","v":"July"},{"$f":"'det.sal input'!C12","v":0},{"$f":"'det.sal input'!D12","v":0},7.0000000000000007E-2,0,null,0]
[null,{"$f":"'new statement'!B84:C84","v":"August"},{"$f":"'det.sal input'!C13","v":0},{"$f":"'det.sal input'!D13","v":0},7.0000000000000007E-2,0,null,0]
[null,{"$f":"'new statement'!B85:C85","v":"September"},{"$f":"'det.sal input'!C14","v":0},{"$f":"'det.sal input'!D14","v":0},7.0000000000000007E-2,0,null,0]
[null,{"$f":"'new statement'!B86:C86","v":"October"},{"$f":"'det.sal input'!C15","v":0},{"$f":"'det.sal input'!D15","v":0},7.0000000000000007E-2,0,null,0]
[null,{"$f":"'new statement'!B87:C87","v":"November"},{"$f":"'det.sal input'!C16","v":0},{"$f":"'det.sal input'!D16","v":0},7.0000000000000007E-2,0,null,0]
[null,{"$f":"'new statement'!B88:C88","v":"December"},{"$f":"'det.sal input'!C17","v":0},{"$f":"'det.sal input'!D17","v":0},7.0000000000000007E-2,0,null,0]
[null,{"$f":"'new statement'!B89:C89","v":"Jan- 2024"},{"$f":"'det.sal input'!C18","v":0},{"$f":"'det.sal input'!D18","v":0},7.0000000000000007E-2,0,null,0]
[null,{"$f":"'new statement'!B90:C90","v":"Feb-2024"},{"$f":"'det.sal input'!C19","v":0},{"$f":"'det.sal input'!D19","v":0},7.0000000000000007E-2,0,null,0]
[null,"* AGP applicable only for UGC scale officers",null,null,null,null,null,"CORPORATION",null,null,"MUNICIPALITY DISTRICT HQ",null,null,"MUNICIPALITY",null,null,"PANCHAYATH",null,"SEL CORP","SEL MU HQ","SEL MUN","SSEL PAN"]
[null,null,null,null,null,null,"%","MIN","MAX","%","MIN","MAX","%","MIN","MAX","%","MIN","MAX",null,null,null,null,"SELECTED"]
[null,{"$f":"ROUND((C7+D7)*E7,0)","v":0},null,null,null,null,{"$f":"ROUND((C7+D7)*0.1,1)","v":0},2300,10000,{"$f":"ROUND((C7+D7)*0.08,1)","v":0},2000,8000,{"$f":"ROUND((C7+D7)*0.06,1)","v":0},1500,6000,{"$f":"ROUND((C7+D7)*0.04,1)","v":0},1200,4000,{"$f":"IF(G21>=I21,I21,IF(H21>=G21,H21,G21))","v":2300},{"$f":"IF(J21>=L21,L21,IF(K21>=J21,K21,J21))","v":2000},{"$f":"IF(M21>=O21,O21,IF(N21>=M21,N21,M21))","v":1500},{"$f":"IF(P21>=R21,R21,IF(Q21>=P21,Q21,P21))","v":1200},{"$f":"IF(PERSONAL!$H$18=\"NO\",0,IF('det.sal input'!$B$6=\"PENSION\",0,IF(PERSONAL!$H$13='DA ALTER'!$H$19,'DA ALTER'!S21,IF(PERSONAL!$H$13='DA ALTER'!$K$19,'DA ALTER'!T21,IF(PERSONAL!$H$13='DA ALTER'!$N$19,'DA ALTER'!U21,IF(PERSONAL!$H$13='DA ALTER'!$Q$19,'DA ALTER'!V21,0))))))","v":0}]
[null,{"$f":"ROUND((C8+D8)*E8,0)","v":0},null,null,null,null,{"$f":"ROUND((C8+D8)*0.1,1)","v":0},2300,10000,{"$f":"ROUND((C8+D8)*0.08,1)","v":0},2000,8000,{"$f":"ROUND((C8+D8)*0.06,1)","v":0},1500,6000,{"$f":"ROUND((C8+D8)*0.04,1)","v":0},1200,4000,{"$f":"IF(G22>=I22,I22,IF(H22>=G22,H22,G22))","v":2300},{"$f":"IF(J22>=L22,L22,IF(K22>=J22,K22,J22))","v":2000},{"$f":"IF(M22>=O22,O22,IF(N22>=M22,N22,M22))","v":1500},{"$f":"IF(P22>=R22,R22,IF(Q22>=P22,Q22,P22))","v":1200},{"$f":"IF(PERSONAL!$H$18=\"NO\",0,IF('det.sal input'!$B$6=\"PENSION\",0,IF(PERSONAL!$H$13='DA ALTER'!$H$19,'DA ALTER'!S22,IF(PERSONAL!$H$13='DA ALTER'!$K$19,'DA ALTER'!T22,IF(PERSONAL!$H$13='DA ALTER'!$N$19,'DA ALTER'!U22,IF(PERSONAL!$H$13='DA ALTER'!$Q$19,'DA ALTER'!V22,0))))))","v":0}]
[null,0,null,null,null,null,0,2300,10000,0,2000,8000,0,1500,6000,0,1200,4000,2300,2000,1500,1200,{"$f":"IF(PERSONAL!$H$18=\"NO\",0,IF('det.sal input'!$B$6=\"PENSION\",0,IF(PERSONAL!$H$13='DA ALTER'!$H$19,'DA ALTER'!S23,IF(PERSONAL!$H$13='DA ALTER'!$K$19,'DA ALTER'!T23,IF(PERSONAL!$H$13='DA ALTER'!$N$19,'DA ALTER'!U23,IF(PERSONAL!$H$13='DA ALTER'!$Q$19,'DA ALTER'!V23,0))))))","v":0}]
[null,0,null,null,null,null,0,2300,10000,0,2000,8000,0,1500,6000,0,1200,4000,2300,2000,1500,1200,{"$f":"IF(PERSONAL!$H$18=\"NO\",0,IF('det.sal input'!$B$6=\"PENSION\",0,IF(PERSONAL!$H$13='DA ALTER'!$H$19,'DA ALTER'!S24,IF(PERSONAL!$H$13='DA ALTER'!$K$19,'DA ALTER'!T24,IF(PERSONAL!$H$13='DA ALTER'!$N$19,'DA ALTER'!U24,IF(PERSONAL!$H$13='DA ALTER'!$Q$19,'DA ALTER'!V24,0))))))","v":0}]
[null,0,null,null,null,null,0,2300,10000,0,2000,8000,0,1500,6000,0,1200,4000,2300,2000,1500,1200,{"$f":"IF(PERSONAL!$H$18=\"NO\",0,IF('det.sal input'!$B$6=\"PENSION\",0,IF(PERSONAL!$H$13='DA ALTER'!$H$19,'DA ALTER'!S25,IF(PERSONAL!$H$13='DA ALTER'!$K$19,'DA ALTER'!T25,IF(PERSONAL!$H$13='DA ALTER'!$N$19,'DA ALTER'!U25,IF(PERSONAL!$H$13='DA ALTER'!$Q$19,'DA ALTER'!V25,0))))))","v":0}]
[null,0,null,null,null,null,0,2300,10000,0,2000,8000,0,1500,6000,0,1200,4000,2300,2000,1500,1200,{"$f":"IF(PERSONAL!$H$18=\"NO\",0,IF('det.sal input'!$B$6=\"PENSION\",0,IF(PERSONAL!$H$13='DA ALTER'!$H$19,'DA ALTER'!S26,IF(PERSONAL!$H$13='DA ALTER'!$K$19,'DA ALTER'!T26,IF(PERSONAL!$H$13='DA ALTER'!$N$19,'DA ALTER'!U26,IF(PERSONAL!$H$13='DA ALTER'!$Q$19,'DA ALTER'!V26,0))))))","v":0}]
[null,0,null,null,null,null,0,2300,10000,0,2000,8000,0,1500,6000,0,1200,4000,2300,2000,1500,1200,{"$f":"IF(PERSONAL!$H$18=\"NO\",0,IF('det.sal input'!$B$6=\"PENSION\",0,IF(PERSONAL!$H$13='DA ALTER'!$H$19,'DA ALTER'!S27,IF(PERSONAL!$H$13='DA ALTER'!$K$19,'DA ALTER'!T27,IF(PERSONAL!$H$13='DA ALTER'!$N$19,'DA ALTER'!U27,IF(PERSONAL!$H$13='DA ALTER'!$Q$19,'DA ALTER'!V27,0))))))","v":0}]
[null,0,null,null,null,null,0,2300,10000,0,2000,8000,0,1500,6000,0,1200,4000,2300,2000,1500,1200,{"$f":"IF(PERSONAL!$H$18=\"NO\",0,IF('det.sal input'!$B$6=\"PENSION\",0,IF(PERSONAL!$H$13='DA ALTER'!$H$19,'DA ALTER'!S28,IF(PERSONAL!$H$13='DA ALTER'!$K$19,'DA ALTER'!T28,IF(PERSONAL!$H$13='DA ALTER'!$N$19,'DA ALTER'!U28,IF(PERSONAL!$H$13='DA ALTER'!$Q$19,'DA ALTER'!V28,0))))))","v":0}]
[null,0,null,null,null,null,0,2300,10000,0,2000,8000,0,1500,6000,0,1200,4000,2300,2000,1500,1200,{"$f":"IF(PERSONAL!$H$18=\"NO\",0,IF('det.sal input'!$B$6=\"PENSION\",0,IF(PERSONAL!$H$13='DA ALTER'!$H$19,'DA ALTER'!S29,IF(PERSONAL!$H$13='DA ALTER'!$K$19,'DA ALTER'!T29,IF(PERSONAL!$H$13='DA ALTER'!$N$19,'DA ALTER'!U29,IF(PERSONAL!$H$13='DA ALTER'!$Q$19,'DA ALTER'!V29,0))))))","v":0}]
[null,0,null,null,null,null,0,2300,10000,0,2000,8000,0,1500,6000,0,1200,4000,2300,2000,1500,1200,{"$f":"IF(PERSONAL!$H$18=\"NO\",0,IF('det.sal input'!$B$6=\"PENSION\",0,IF(PERSONAL!$H$13='DA ALTER'!$H$19,'DA ALTER'!S30,IF(PERSONAL!$H$13='DA ALTER'!$K$19,'DA ALTER'!T30,IF(PERSONAL!$H$13='DA ALTER'!$N$19,'DA ALTER'!U30,IF(PERSONAL!$H$13='DA ALTER'!$Q$19,'DA ALTER'!V30,0))))))","v":0}]
[null,0,null,null,null,null,0,2300,10000,0,2000,8000,0,1500,6000,0,1200,4000,2300,2000,1500,1200,{"$f":"IF(PERSONAL!$H$18=\"NO\",0,IF('det.sal input'!$B$6=\"PENSION\",0,IF(PERSONAL!$H$13='DA ALTER'!$H$19,'DA ALTER'!S31,IF(PERSONAL!$H$13='DA ALTER'!$K$19,'DA ALTER'!T31,IF(PERSONAL!$H$13='DA ALTER'!$N$19,'DA ALTER'!U31,IF(PERSONAL!$H$13='DA ALTER'!$Q$19,'DA ALTER'!V31,0))))))","v":0}]
[null,0,null,null,null,null,0,2300,10000,0,2000,8000,0,1500,6000,0,1200,4000,2300,2000,1500,1200,{"$f":"IF(PERSONAL!$H$18=\"NO\",0,IF('det.sal input'!$B$6=\"PENSION\",0,IF(PERSONAL!$H$13='DA ALTER'!$H$19,'DA ALTER'!S32,IF(PERSONAL!$H$13='DA ALTER'!$K$19,'DA ALTER'!T32,IF(PERSONAL!$H$13='DA ALTER'!$N$19,'DA ALTER'!U32,IF(PERSONAL!$H$13='DA ALTER'!$Q$19,'DA ALTER'!V32,0))))))","v":0}]

{"sheet":"tds det","index":18,"n_rows":47,"n_cols":13,"rows_kept":47,"cut":false,"hidden":false,"merged":[[21,1,21,4],[27,1,27,4],[31,1,31,4],[24,1,24,4],[35,1,35,4],[2,12,2,13],[2,1,2,4],[2,6,2,7],[2,8,2,10],[4,5,4,6],[3,1,3,4],[43,1,43,4],[6,1,6,4],[10,5,10,6],[7,5,7,6],[17,1,17,2],[12,1,12,2],[10,1,10,2],[7,1,7,4],[18,1,18,2],[9,1,9,2],[11,1,11,2],[8,1,8,4],[16,1,16,2],[15,1,15,4],[38,1,38,4],[39,1,39,4]]}
[null,{"$f":"\"File of \"& PERSONAL!H4","v":"File of "},"Page 4",null,null,"Scrole mouse up & down "]
[]
[null,"INTEREST INCOME / CAPITAL GAIN INCOME  / INCOME FROM PROFESSION (Table 1,2,3), Advance Tax, Other TDS payments (Table 4)",null,null,null,null,{"$f":"SUM(#REF!)","v":{"$error":"#REF!"}}]
[null,"INTEREST INCOME ",null,null,null,"മൗസ് സ്ക്രോള്‍ ചെയ്യുക"]
[1,"Income from CAPITAL GAIN if any [ കാപ്പിറ്റല്‍ ഗെയിന്‍ വരുമാനം ] ",null,null,"`"]
[null,"Income from PROFESSION  [പ്രൊഫെഷന്‍ വരുമാനം Eg. Doctor's Pvt practice earnings ‍]",null,null,{"$f":"E15","v":0}]
[2,"1)  INTERST  FROM BANKS, POST OFFICE DEPOSITS, Taxable dividents, SB A/C, Etc.  (പലിശ വരുമാനം ചുവടെ) Place the mouse on this lines to read more "]
[null,null,null,null,null,"HOME "]
[]
[null,"NAME OF DEPOSIT ",null,"INTEREST RECEIVED (AFTER DEDUCTING TDS IF ANY  ) നേടിയ പലിശ (പലിശയില്‍ നികുതി പിടിച്ചിട്ടുണ്ടെങ്കില്‍ നികുതി കിഴിച്ചതിനു ശേഷമുള്ളത്_(ഒന്നില്‍ കൂടുതല്‍ DEPOSIT കള്‍ ഉണ്ടെങ്കില്‍ അവയുടെ പലിശ കൂട്ടി മൊത്തം തുക കാണിക്കുക) Amount RS. ","TAX (TDS) DEDUCTED FROM DEPOST   IF ANY ( പലിശയില്‍ നികുതി പിടിച്ചിട്ടുണ്ടെങ്കില്‍ പിടിച്ച നികുതി (TDS) )   Amount RS. ",null,null,null,null,"actual",null,null,{"$f":"D11+D12+D13+E11+E12+E13","v":0}]
[null,"Fixed deposits / RD/ TIME DEPOSIT  interest",null,null,null,null,null,null,null,"maximum",null,null,50000]
[null,"Any other Interests or Taxable dividents received",null,null,null,null,null,"TOT",null,"minimum",null,null,{"$f":"MIN(M10:M11)","v":0}]
[null,"Total of Interest earned from different SB ACCOUNTS  (വ്യത്യസ്ത സേവിംഗ്സ് ബാങ്കുകളിലെ മൊത്തം പലിശ ഇവിടെ നല്‍കുക വകുപ്പ്   80TTA പ്രകാരമുള്ള  10000 രൂപയുടെ ഇളവ് automatic ആയി പ്രിന്‍റ് ഔട്ട്‌ ല്‍കുറച്ചുകൊള്ളും)",null,null,null,null,null,{"$f":"F13+G13","v":0}]
[null,"2) Income from CAPITAL GAIN if any [ കാപ്പിറ്റല്‍ ഗെയിന്‍ വരുമാനം ] ",null,{"$f":"D38","v":0},{"$f":"E38","v":0},{"$f":"IF((D13+E13-10000)<=0,0,(D13-10000))","v":0}]
[null,"3) Income from PROFESSION  [പ്രൊഫെഷന്‍ വരുമാനം Eg. Doctor's Pvt practice earnings ‍]",null,{"$f":"D42","v":0},{"$f":"E42","v":0}]
[null,"INCOME TAX PAYMENT OTHER THAN AS SALARY DEDUCTION (ശമ്പളക്കിഴിവ് അല്ലാതെ അടച്ച നികുതി )"]
[null,"Name of payment",null,"Details of payment (Challan/ Receipt No./ Date)","Amount Rs."]
[3,"1) Advance tax total (Tax directly paid thorough Bank Challan)(കൂടുതല്‍ വിവരങ്ങള്‍ അറിയാന്‍ മൌസ് തുക എഴുതുന്ന സ്ഥലത്ത് വക്കുക)",null,{"$f":"E46","v":0},{"$f":"D46","v":0}]
[4,"2) Any other TDS payments made",null,{"$f":"E47","v":0},{"$f":"D47","v":0},"total other tds",{"$f":"G13+E19","v":0}]
[null,"ശമ്പളത്തിന് ഉപരിയായി ലഭിച്ച പലിശ വരുമാനം, capital gain വരുമാനം എന്നിവ പട്ടിക 1,2,3 ൽ നൽകുക. For more details, place mouse on this lines"]
[null,"അഡ്വാൻസ് ടാക്സ്, മറ്റ് TDS അടവുകൾ എന്നിവ പട്ടിക 4 ൽ നൽകുക "]
[null,"INTEREST INCOME ",null,null,null,null,"Age category",{"$f":"PERSONAL!H5","v":"Below 60 Years"}]
[null,"Sl No","DEPOSIT DETAILS","Net interest received after deducting TDS if any RS","TDS deducted from the Bank if any RS"]
[null,null,null,null,null,null,null,null,"TAXABLE AMOUNT"]
[null,"FIXED DEPOSITS INTEREST INCOME",null,null,null,{"$f":"IF(F26=0,\"\",\"Taxable amount Old regime Rs\")","v":""},null,null,"SB INTEREST INCL POST","INVEST INT"]
[null,"1-a","Total Interest received from different Fixed deposit (Post office/ Banks/ Co- op societies, KSFE, Pvt banks etc) Show net interest received by you after deductiong TDS if any",null,null,{"$f":"D26+E26","v":0},null,null,{"$f":"IF(H22=\"BELOW 60 YEARS\",F30+F29,0)","v":0},{"$f":"IF(H22=\"BELOW 60 YEARS\",L30+D33+E33+D34+E34,H36-J36+D33+E33+D34+E34)","v":0}]
[]
[null,"SAVINGS BANK DEPOSIT INTEREST INCOME",null,null,null,{"$f":"IF(F29+F30=0,\"\",\"Taxable amount Old regime Rs\")","v":""},null,null,"TAX FOR SENIOR CITIZEN FD"]
[null,"1-b","Post office SB Account interest received  [section 10(15)(i)]",null,null,{"$f":"IF(D29+E29<3501,0,(D29+E29)-3500)","v":0},"case","INVESTMENT","TDS","TOTAL","DEDUCT","NET TAX"]
[null,"1-c","SB Accout interest from other banks including Co op society, banks, KSFE Pvt banks etc",null,null,{"$f":"IF(D30+E30<10001,0,(D30+E30)-10000)","v":0},"Below 60",{"$f":"D26","v":0},{"$f":"E26","v":0},{"$f":"H30+I30","v":0},0,{"$f":"J30-K30","v":0}]
[]
[null,"KURI PROFIT EARNINGS, TAXABLE DIVIDENDS ETC",null,null,null,{"$f":"IF(F33+F34=0,\"\",\"Taxable amount Old regime Rs\")","v":""},"case","ivest","TDS","TOTAL","DEDUCT","NET TAX","MAX LIMIT"]
[null,"1-d","Taxable Dividends",null,null,{"$f":"D33+E33","v":0},"ABOVE 60",{"$f":"H30","v":0},{"$f":"I30","v":0},{"$f":"J30","v":0},50000,{"$f":"IF(J33>=K33,J33-K33,0)","v":0},50000]
[null,"1-e","Earnings from Kuri or similar earnings",null,null,{"$f":"D34+E34","v":0},"SB AC INTEREST",{"$f":"D30","v":0},null,{"$f":"H34","v":0},10000,{"$f":"J34-K34","v":-10000}]
[null,null,null,null,null,null,null,null,"MAX","LESS"]
[null,"CAPITAL GAIN INCOME",null,null,null,null,"above 60 SB+ INVEST LIMIT 50000",{"$f":"IF(H22=\"below 60 years\",J33+H34+D29,J33+H34+F29)","v":0},50000,{"$f":"MIN(H36:I36)","v":0}]
[null,null,"INCOME DETAILS","NET Income after deducting TDS if any","Amount of TDS deducted if any",{"$f":"IF(F38=0,\"\",\"Taxable amount Old regime Rs\")","v":""},"Total TDS including cap gain profession",null,{"$f":"E26+E33+E34+E38+E42","v":0}]
[null,null,"Show Capital Gain Income details after deducting TDS if any in the next cell and TDS on the cell right side",null,null,{"$f":"D38+E38","v":0},"Adv tax + other TDS",null,{"$f":"D46+D47","v":0}]
[]
[null,"INCOME FROM PROFESSION "]
[null,null,"INCOME DETAILS","NET Income after deducting TDS if any","Amount of TDS deducted if any",{"$f":"IF(F42=0,\"\",\"Taxable amount Old regime Rs\")","v":""}]
[null,null,"Show incomes like Doctors private practice, Insurance agents and other professionals",null,null,{"$f":"D42+E42","v":0}]
[]
[null,"INCOME TAX PAYMENT OTHER THAN AS SALARY DEDUCTION"]
[null,null,"Details ","Amount of Payment RS","BSR Code or other challan details"]
[null,1," Advance tax total (Tax directly paid thorough Bank Challan)"]
[null,2," Any other TDS payments made other than Salary deduction"]

{"sheet":"new statement","index":19,"n_rows":261,"n_cols":34,"rows_kept":261,"cut":false,"hidden":false,"merged":[[1,1,1,17],[1,18,1,21],[85,0,95,0],[88,1,88,2],[76,12,76,21],[76,3,76,11],[94,1,94,2],[93,1,93,2],[85,1,85,2],[90,1,90,2],[80,1,80,2],[77,1,77,2],[78,1,78,2],[91,1,92,1],[95,1,95,2],[86,1,86,2],[81,1,81,2],[89,1,89,2],[87,1,87,2],[83,1,83,2],[79,1,79,2],[82,1,82,2],[41,14,41,15],[40,17,40,19],[85,24,85,30],[49,3,49,12],[49,14,49,15],[48,14,48,15],[57,17,57,19],[48,17,48,19],[54,3,54,12],[83,24,83,29],[55,3,55,12],[59,17,59,19],[61,17,61,19],[56,17,56,19],[55,14,55,15],[60,17,60,19],[54,17,54,19],[58,17,58,19],[60,2,60,16],[56,14,56,15],[54,14,54,15],[69,13,69,16],[68,13,68,16],[67,17,67,19],[84,1,84,2],[61,2,61,16],[31,24,31,27],[30,14,30,15],[36,14,36,15],[35,3,35,13],[38,14,38,15],[32,24,32,27],[39,14,39,15],[36,3,36,12],[32,14,32,15],[31,17,31,19],[34,14,34,15],[37,24,37,27],[37,3,37,12],[29,24,29,27],[29,17,29,19],[4,22,6,25],[8,3,8,15],[7,17,7,19],[13,3,13,12],[13,14,13,15],[6,3,6,15],[8,17,8,19],[11,3,11,15],[19,2,19,12],[6,17,6,19],[7,3,7,15],[14,3,14,11],[15,14,15,15],[16,2,16,13],[15,17,15,19],[16,17,16,19],[22,14,22,15],[17,2,17,12],[29,3,29,12],[18,17,18,19],[14,14,14,15],[20,2,20,12],[21,17,21,19],[25,14,25,15],[51,14,51,15],[42,2,42,12],[46,14,46,15],[44,2,44,13],[29,14,29,15],[34,3,34,12],[47,14,47,15],[26,17,26,19],[23,2,23,13],[25,17,25,19],[40,3,40,12],[31,14,31,15],[31,3,31,12],[33,14,33,15],[32,3,32,12],[45,3,45,12],[43,2,43,12],[42,14,42,15],[49,17,49,19],[21,2,21,15],[24,14,24,15],[46,3,46,12],[52,3,52,13],[53,3,53,12],[53,14,53,15],[28,1,34,1],[33,3,33,12],[48,3,48,12],[37,14,37,15],[47,3,47,12],[44,17,44,19],[43,14,43,15],[45,14,45,15],[50,14,50,15],[41,3,41,13],[50,3,50,13],[51,3,51,12],[51,17,51,19],[44,14,44,15],[67,2,67,16],[75,1,75,21],[74,6,74,15],[73,14,73,21],[71,15,71,21],[69,2,69,12],[63,17,63,19],[65,17,65,19],[64,17,64,19],[68,17,68,19],[63,2,63,12],[68,2,68,12],[66,2,66,12],[66,17,66,19],[69,17,69,19],[86,24,86,29],[26,2,26,15],[23,14,23,15],[43,17,43,19],[43,24,43,27],[42,17,42,19],[45,17,45,19],[40,14,40,15],[34,24,34,27],[84,24,84,28],[35,14,35,15],[38,3,38,12],[39,3,39,12],[27,17,27,21],[27,14,27,16],[32,17,32,19],[27,2,27,12],[55,17,55,19],[59,2,59,15],[52,14,52,15],[57,2,57,16],[62,2,62,12],[62,17,62,19],[65,2,65,10],[0,3,0,14],[0,15,0,16],[0,22,0,25],[64,2,64,15],[34,17,34,19],[28,17,28,21],[2,1,2,21],[4,5,4,13],[3,1,3,19],[22,2,22,13],[6,1,11,1],[12,1,16,1],[5,5,5,8],[11,17,11,19],[15,3,15,12],[17,17,17,19],[19,17,19,19],[18,10,18,14],[22,17,22,19],[4,16,4,19],[4,1,4,3],[4,14,4,15],[20,17,20,19],[5,17,5,21]]}
[{"$f":"F5&\" \"&B2","v":"0 ANTICIPATORY INCOME TAX STATEMENT(OLD RATE OPTION)-FINANCIAL YEAR 2023-24 (AY 24-25) "},{"$f":"'new statement (2)'!B1","v":0},{"$f":"'new statement (2)'!C1","v":0},{"$f":"IF(C1<B1,\"Warning ! Your are in the wrong field. The Old Regime option is not suitable for you.  To choose  the economical option, click the green button on the right side\",\"\")","v":""},null,null,null,null,null,null,null,null,null,null,null,{"$f":"IF(D1=\"\",0,1)","v":0},null,null,null,null,null,null,{"$f":"IF(PERSONAL!H9=\"\",\"\",IF('new statement'!R16=\"nil\",\"വാടക വീട്ടില്‍ താമസിക്കുന്നവര്‍ക്കുള്ള ഇളവ് ലഭിക്കാന്‍ നല്‍കുന്ന വാടക, ശമ്പളത്തിന്റെ 10% നു മേലെയായിരിക്കണം, താങ്കള്‍ക്ക് ഈ ആനുകൂല്യം ലഭിക്കില്ല  \",\"\"))","v":""}]
[null,{"$f":"IF(print!P9=\"ANTICIPATORY TAX CALCULATOR\",\"ANTICIPATORY INCOME TAX STATEMENT(OLD RATE OPTION)-FINANCIAL YEAR 2023-24 (AY 24-25) \",\"INCOME TAX STATEMENT(OLD RATE OPTION)-FINANCIAL YEAR 2023-24 (AY 24-25)\")","v":"ANTICIPATORY INCOME TAX STATEMENT(OLD RATE OPTION)-FINANCIAL YEAR 2023-24 (AY 24-25) "},null,null,null,null,null,null,null,null,null,null,null,null,null,null,null,null,{"$f":"CUSTOMISE!H22","v":0}]
[null,{"$f":"PERSONAL!H10","v":"SALARY"}]
[]
[{"$f":"R6","v":"OLD REGIME RATE"},"Name",null,null,null,{"$f":"PERSONAL!H4","v":0},null,null,null,null,null,null,null,null,"PAN :",null,{"$f":"PERSONAL!H7","v":0},null,null,null,null,null,{"$f":"IF(PERSONAL!H8=\"no\",\"\",IF('det.sal input'!AC39>'det.sal input'!AB38,\"You cannot claim for benifit of living in a rental home [HRA benifit], because rent paid amount is less than 10% of your salary\",\"\"))","v":""}]
[null,"Designation     ",null,null,null,{"$f":"PERSONAL!H6","v":0},null,null,null,null,null,{"$f":"PERSONAL!H5","v":"Below 60 Years"},null,null,null,null,null,"OLD REGIME RATE"]
[null,1,"a","Gross Salary (Excluding interest on arrear salary),  Festival allowance, Bonus,Leave Surrender (includes Salary, DA, HRA, CCA, Interim Relief, , DA Arrear, Pay Revision Arrear  etc)",null,null,null,null,null,null,null,null,null,null,null,null,":",{"$f":"L96-L91-L94-'arrear det'!K13","v":0},null,null,null,null,null,null,null,null,{"$f":"'det.sal input'!AF29","v":1}]
[null,null,"b","Leave Surrender",null,null,null,null,null,null,null,null,null,null,null,null,":",{"$f":"L94","v":0},null,null,null,null,"medical reimb actual",{"$f":"'det.sal input'!W28","v":0},15000,"excess=",{"$f":"IF(AA7=1,0,IF((X8-Y8)>0,(X8-Y8),0))","v":0}]
[null,null,"c","Festival Allowance / Bonus / Ex-gratia and incentive",null,null,null,null,null,null,null,null,null,null,null,null,":",{"$f":"L91","v":0},null,null,null,null,{"$f":"SUM(R7:T9)","v":0}]
[null,null,"d","Value of perquisites (Iincludes Employer's contribution to NPS, Medical reimb. Taxable portion)",null,null,null,null,null,null,null,null,null,null,null,null,":",null,null,{"$f":"'det.sal input'!W32+'det.sal input'!W33+X8","v":0},null,null,null,null,null,null,"IF((V8-W8)>0,(V8-W8),0))"]
[null,null,"e","Profits in lieu of salary (S17-3)",null,null,null,null,null,null,null,null,null,null,null,null,":",null,null,{"$f":"'det.sal input'!W34","v":0},null,null,null,{"$f":"PERSONAL!H8","v":"NO"}]
[null,null,"f ","Total Salary Income (a+b+c+d+e)",null,null,null,null,null,null,null,null,null,null,null,null,":",{"$f":"SUM(R7:T11)","v":0}]
[null,2,"Deduction towards rent paid ",null,null,null,null,{"$f":"IF(PERSONAL!H8=\"no\",\"(not available)\",\"(Least amount gets excemption)\")","v":"(not available)"}]
[null,null,"i)","Actual HRA Received relating to the period",null,null,":",null,null,null,null,null,null,":",{"$f":"IF(X11=\"NO\",\"\",'det.sal input'!AB40)","v":""}]
[null,null,"ii)","Actual Rent paid in excess 1/10th of the salary",null,null,null,null,null,null,null,null,{"$f":"IF(O15=0,\"NIL\",\"\")","v":""},":",{"$f":"IF(X11=\"NO\",\"\",IF(Y15>AA15,Y15-AA15,0))","v":""},null,null,null,null,null,null,null,null,"rent paid =",{"$f":"'det.sal input'!AB38","v":0},"1/10 of sal=",{"$f":"'det.sal input'!AC39","v":0},{"$f":"IF(Y15>AA15,Y15-AA15,0)","v":0}]
[null,null,"iii)","40% Salary ( For this salary means Basic + DA)",null,null,":",null,null,null,null,null,null,":",{"$f":"IF(X11=\"NO\",\"\",AA16)","v":""},null,null,{"$f":"IF(R17=0,\"NIL\",R17)","v":"NIL"},null,null,null,null,null,null,null,"40%sal =",{"$f":"ROUND(('det.sal input'!AB39*0.4),0)","v":0}]
[null,null,{"$f":"IF(PERSONAL!H8=\"no\",\"\",\" (Here, Salary means Basic+DA+AGP only, but include arrear/ surrender values relating to this period.) That is \"&'det.sal input'!R40&\"+\"&'det.sal input'!T40&\"+\"&'det.sal input'!W40&\"\")","v":""},null,null,null,null,null,null,null,null,null,null,null,null,null,":",{"$f":"MIN(O14:P16)","v":0}]
[null,3,"Balance ( 1- 2)",null,null,null,null,null,null,null,null,null,null,null,null,null,":",{"$f":"R12-R17","v":0}]
[null,4,{"$f":"\" Less Allowance to the extent exempt u/s10   \"","v":" Less Allowance to the extent exempt u/s10   "},null,null,null,null,null,null,null,{"$f":"INVEST!D28&\" + \"&INVEST!D29&\" + \"&INVEST!D30&\" + \"&INVEST!D31","v":" +  +  + "},null,null,null,null,{"$f":"INVEST!F28+INVEST!F29+INVEST!F30+INVEST!F31","v":0},null,{"$f":"P19","v":0}]
[null,5,"Less Profession tax paid, Enterteainment Allowance exempted",null,null,null,null,null,null,null,null,null,null,{"$f":"'det.sal input'!W31& \" +\"&'det.sal input'!W35","v":" +"},null,null,null,{"$f":"'det.sal input'!W31+'det.sal input'!W35","v":0}]
[null,6,"Less Standard deduction ( maximum 50000)",null,null,null,null,null,null,null,null,null,null,null,null,null,null,{"$f":"IF((R18-R19-R20)>50000,50000,(R18-R19-R20))","v":0}]
[null,"6a","Net Salary Income [Income chargeble under the head salary]  (3-4-5-6)",null,null,null,null,null,null,null,null,null,null,null,null,null,":",{"$f":"R18-R19-R20-R21","v":0}]
[null,7,"1. Income from house property (interst on Housing loan is a negative income)",null,null,null,null,null,null,null,null,null,null,null,{"$f":"0-MIN(W23:X23)","v":0},null,null,{"$f":"IF(ISNUMBER(#REF!),#REF!,\"Nil\")","v":"Nil"},null,null,null,null,200000,{"$f":"INVEST!F17","v":0},{"$f":"X23-W23","v":-200000}]
[null,null,"2.Other sources Income INCLUDING PAY REVISION ARREAR INTEREST [ Interest on investment / Family pension__ (1/3 of family pension or 15000 whichever  is less is exempted) For SB account interest Rs. 10000 is exempted U/S  80TTA .Post office SB interest 3500 get exemption.  FD interest is fully taxable (senior citizen upto 50000 exempt, Post off SB Rs. 3500 exemption extra)",null,null,null,null,null,null,null,null,null,null,null,{"$f":"'det.sal input'!W27+'tds det'!I26+'tds det'!J26+AB24","v":0},null,null,{"$f":"\"Pay revision interest \"&'arrear det'!K13","v":"Pay revision interest 0"},{"$f":"\"Post off SB+ Other SB \"&'tds det'!I26","v":"Post off SB+ Other SB 0"},{"$f":"\"Investment Interest \"&'tds det'!J26","v":"Investment Interest 0"},null,{"$f":"\"Family Pension \"&AB24","v":"Family Pension 0"},"1/3 family pension",{"$f":"ROUND('det.sal input'!W30/3,0)","v":0},15000,{"$f":"MIN(X24:Y24)","v":0},"taxable portion of family pen",{"$f":"'det.sal input'!W30-'new statement'!Z24","v":0}]
[null,null,"3. Income from profession",null,null,null,null,null,null,null,null,null,null,null,{"$f":"'tds det'!F42","v":0}]
[null,null,"4.Captal gain income",null,null,null,null,null,null,null,null,null,null,null,{"$f":"'tds det'!F38","v":0},null,"Total",{"$f":"SUM(O23:P26)","v":0}]
[null,8,"Gross Total Income (6+7)",null,null,null,null,null,null,null,null,null,null,null,null,null,":",{"$f":"R22+R26","v":0}]
[null,9,"Deduction under chapter VI-A",null,null,null,null,null,null,null,null,null,null,null,"Amount spent",null,null,"Eligible amount"]
[null,null,"A - Deduction under section 80C",null,null,null,null,null,null,null,null,null,null,null,null,null,null,"(See point 9 D)"]
[null,null,"a) ","Providend fund contribution",null,null,null,null,null,null,null,null,null,":",{"$f":"M96","v":0}]
[null,null,"c)","State Life Insurance Policy (SLI)",null,null,null,null,null,null,null,null,null,":",{"$f":"N96","v":0}]
[null,null,"c) ","Group Insurance Scheme (GIS)",null,null,null,null,null,null,null,null,null,":",{"$f":"O96","v":0}]
[null,null,"d) ","Tax saving Fixed deposits (Available at all banks) /Sukanya samrudhi",null,null,null,null,null,null,null,null,null,":",{"$f":"INVEST!F8","v":0}]
[null,null,"e) ","Life Insurence  salary deduction",null,null,null,null,null,null,null,null,null,null,{"$f":"P96","v":0}]
[null,null,"f) ","Life Insurence other than salary deduction ",null,null,null,null,null,null,null,null,null,":",{"$f":"INVEST!F5","v":0}]
[null,null,"g) ",{"$f":"'det.sal input'!R6&\" +  \"&'det.sal input'!T6","v":"? +  ?"},null,null,null,null,null,null,null,null,null,null,{"$f":"R96","v":0}]
[null,null,"h) ","NSC VIII th issue (Nationional Savings certificate from post offices)",null,null,null,null,null,null,null,null,null,":",{"$f":"INVEST!F7","v":0}]
[null,null,"i)","Public Provident Fund (PPF) (Available at Post offfices)",null,null,null,null,null,null,null,null,null,":",{"$f":"INVEST!F9","v":0}]
[null,null,null,"ULIP/ Tax saving mutual funds",null,null,null,null,null,null,null,null,null,null,{"$f":"INVEST!F10","v":0},null,null,null,null,null,null,null,"nps allowed amt"]
[null,null,"j)","Tuition Fees ( Paid  for full time education to any two children -only the tuition fee portion-donations should be excluded)",null,null,null,null,null,null,null,null,null,":",{"$f":"INVEST!F11","v":0},null,null,null,null,null,null,null,{"$f":"O44","v":0},{"$f":"IF(O44=0,\"\",(O45-O44-150000)*-1)","v":""}]
[null,null,"k)","Housing Loan Repayment (PRINCIPAL PORTION ONLY) for construction loan only. Not for addition / repair loan etc.  Stamp duty paid for purchase of property can be included",null,null,null,null,null,null,null,null,null,":",{"$f":"INVEST!F12","v":0},null,null,null,null,null,null,null,"OVER 1.5",{"$f":"IF(O45<=150000,0,(O45)-150000)","v":0},"MAX 80CC-1B=",50000,"TOT NPS=",{"$f":"X46","v":0},"MIN AMT =",{"$f":"MIN(X41,Z41,AB41)","v":0}]
[null,null,"l)",{"$f":"INVEST!E13","v":0},null,null,null,null,null,null,null,null,null,null,{"$f":"INVEST!F13","v":0},null,null,null,null,null,null,null,"Tot VIA excl nps=",{"$f":"SUM(O30:P43)","v":0},"ALLOED VIA =",150000]
[null,null,"B- Contribution to Pension Fund (80CCC)",null,null,null,null,null,null,null,null,null,null,null,{"$f":"INVEST!F6","v":0}]
[null,null,"C-Contrubution to National Pension Scheme - NPS (80CCD)",null,null,null,null,null,null,null,null,null,null,":",{"$f":"X46","v":0},null,null,{"$f":"MIN(W40:X40)","v":0},null,null,null,null,"nps sal ded",{"$f":"'det.sal input'!U26","v":0}]
[null,null,"D- Total investment under  Sec.  80C, 80CCC, 80CCD, eligible amt. limited to 1.5  lakh",null,null,null,null,null,null,null,null,null,null,null,{"$f":"SUM(O30:P44)","v":0},null,null,{"$f":"IF(O45<=150000,O45,150000)","v":0},null,null,null,null,"nps direct pay",{"$f":"INVEST!F15","v":0}]
[null,10,"a. ","Contrubution to National Pension Scheme - NPS Section 80CCD(1B) Investment upto 50000 can be made additionally",null,null,null,null,null,null,null,null,null,":",{"$f":"AD41","v":0},null,null,null,null,null,null,null,"total NPS",{"$f":"X44+X45","v":0}]
[null,null,"b.","Employer's contribution to NPS [Up to 10% Pay+Da+AGPgets excemption u/s Section 80CCD(2)]",null,null,null,null,null,null,null,null,null,null,{"$f":"IF(Z47<X47,Z47,X47)","v":0},null,null,null,null,null,null,null,"total pay+da+agp 10% =",{"$f":"ROUND(AA47*0.1,0)","v":0},"Empr contri =",{"$f":"'det.sal input'!W32","v":0},{"$f":"'det.sal input'!C26+'det.sal input'!D26+'det.sal input'!F26-'det.sal input'!C20","v":0}]
[null,null,"c.","Investment in Rajiv Gandhi Equity Savings Scheme 80CCG (50% of investment gets exemption.Maximum 25000)"]
[null,null,"c) ","Mediclaim ( Maximum of Rs.25,000 for self, spouse, children and Rs.25000 for Parents. if Parents are senior citizens Rs. 50,000)(80 D)",null,null,null,null,null,null,null,null,null,":",{"$f":"'MEDI INS OTHER DED'!Q16","v":0},null,null,null,null,null,null,null,"max 80 D=",55000,"Actual 80d =",{"$f":"INVEST!F18","v":0}]
[null,null,"d) ","Expenditure on Medical treatment of mentally or physically handicapped dependents (including Specified investments there on). ( Max. Rs.75,000/- in case of severe disability max. Rs.1,25,000) (80DD)",null,null,null,null,null,null,null,null,null,":",{"$f":"IF(Z50<X50,Z50,X50)","v":0},null,null,null,null,null,null,null,"max 80dd=",125000,"Actual 80dd =",{"$f":"INVEST!F21","v":0}]
[null,null,"e) ","For medical treatment of specified diseases of self/dependent . Actual exp. Or Rs. 40000/60000/ 80000 which ever is less gets excemption depending on age. Should submit Form-10-I. (80 DDB)",null,null,null,null,null,null,null,null,null,null,{"$f":"INVEST!F22","v":0}]
[null,null,"f)","Any amount of interest paid for Educational Loan  for higher education of the employee's dependent children [80E]",null,null,null,null,null,null,null,null,null,":",{"$f":"INVEST!F20","v":0}]
[null,null,"g) ","Additional deduction on housing loan interest (Max 50000) if conditions are satisfied. 1. loan amount is not above Rs. 35 lakhs,  2.  Loan sanctioned in 2016-17,  3. He is a first time home buyer,   4.  cost of house does not exceed Rs. 50 lakhs (80EE)",null,null,null,null,null,null,null,null,null,null,{"$f":"IF(W53<0,0,W53)","v":0},null,null,null,null,null,null,null,{"$f":"IF(PERSONAL!H20=\"YES\",'new statement'!X23-'new statement'!W23,0)","v":0}]
[null,null,"h) ","Electric vehicle loan interest repayment (up to 1.5 Lakh) (80EEB)",null,null,null,null,null,null,null,null,null,null,{"$f":"INVEST!F16","v":0}]
[null,null,"i) ","Donation to special funds only  PM's/ CM's  Relief Funds,  Earth quake fund Etc (80G)",null,null,null,null,null,null,null,null,null,":",{"$f":"INVEST!F19+S96","v":0}]
[null,null,"j)","Dedution for differently abled Employees( 80U)For blindness,Hearing impaired, Mental retradation, Mental illness, low vision, Locomotors disability.  Fixed deduction of 75000 (For disability not less than 40%)  / 1.25 Lakh, for severe disability over 80% ",null,null,null,null,null,null,null,null,null,":",{"$f":"INVEST!F23","v":0}]
[null,null,null,"Total of 10",null,null,null,null,null,null,null,null,null,null,{"$f":"SUM(O46:P56)","v":0}]
[null,11,"Total Deduction   (9+10)",null,null,null,null,null,null,null,null,null,null,null,null,null,null,{"$f":"R45+O57","v":0}]
[null,12,"Total Income or Taxable Income  (rounded off to the nearest multiple of ten (8-11)",null,null,null,null,null,null,null,null,null,null,null,"Before rounding",null,{"$f":"R27-R58","v":0},{"$f":"IF(R27-R58>0,ROUND(((R27-R58)/10),0)*10,0)","v":0}]
[null,13,"Tax on Total Income (Up to 2.5 lakh Nil, between 250001and 5 lakh 5%,  between 500001 and 10 lakh 20%, above 10 lakh 30%, (special rates to senior/ super senior citizens )",null,null,null,null,null,null,null,null,null,null,null,null,null,":",{"$f":"IF(ROUND('new form 16'!Y80,0)<1,0,(ROUND('new form 16'!Y80,0)))","v":0}]
[null,14,"Less 87 A Rebate, upto a maximum of Rs.12500, available only if Taxable income is less than 500001 (Rebate u/s 87A)",null,null,null,null,null,null,null,null,null,null,null,null,null,null,{"$f":"IF(R60=0,0,IF(R59>500000,0,IF(12500>R60,R60,12500)))","v":0}]
[null,15,"Balance of Tax after 87A rebate ",null,null,null,null,null,null,null,null,null,null,null,null,null,null,{"$f":"R60-R61","v":0}]
[null,16,"Education Cess @ 4% of  tax",null,null,null,null,null,null,null,null,null,null,null,null,null,":",{"$f":"ROUND(R62*0.04,0)","v":0}]
[null,17,"Total Tax Payable (13-14+16)",null,null,null,null,null,null,null,null,null,null,null,null,null,":",{"$f":"R62+R63","v":0},null,null,null,null,{"$f":"R64","v":0}]
[null,18,"Less : Relief for Arrears of Salary u/s 89(1) attach 10 E set of forms and previous years tax statements",null,null,null,null,null,null,null,null,null,null,null,null,null,":",{"$f":"'ARR MONH SPLIT'!I107","v":0},null,null,null,{"$f":"IF('Form 10E NEW REG'!B2=\"\",\"\",\"ERROR\")","v":""},{"$f":"IF(INVEST!F24>R64,R64,'Form 10E'!H40)","v":0}]
[null,19,"Balance Tax Payable (17-18) rounded to 10 rupees.",null,null,null,null,null,null,null,null,{"$f":"\"( before rounding \"&ROUND(R64-R65,0)&\") \"","v":"( before rounding 0) "},null,null,null,null,":",{"$f":"ROUND((R64-R65),-1)","v":0}]
[null,20,"Amount of Tax already deducted from salary (TDS)",null,null,null,null,null,null,null,null,null,null,null,null,null,":",{"$f":"'det.sal input'!Q26","v":0}]
[null,21,"Amount of Tax deducted from interest on deposits (FD,RD etc ), Capital Gain, Profession Income",null,null,null,null,null,null,null,null,null,null,null,null,null,null,{"$f":"'tds det'!I37","v":0},null,null,null,null,{"$f":"R66-R68-R69","v":0},{"$f":"ROUND(W68,-1)","v":0}]
[null,22,"Advance tax/ other TDS paid (Challan pay) details :",null,null,null,null,null,null,null,null,null,null,{"$f":"'tds det'!D18&\", \"&'tds det'!E47","v":"0, "},null,null,null,{"$f":"'tds det'!I38","v":0}]
[null,23,{"$f":"IF(R70>=0,\"Balance of Tax  to be deducted now (19-20-21-22) \",\"Excess TDS payment made, can apply for refund during e-filing\")","v":"Balance of Tax  to be deducted now (19-20-21-22) "},null,null,null,null,null,null,null,null,null,null,{"$f":"\"Before rounding \"&R64-R65-R67-R68-R69","v":"Before rounding 0"},null,null,null,{"$f":"ROUND((R66-R67-R68-R69),0)","v":0},null,null,null,null,{"$f":"ROUND(R70,-1)","v":0}]
[null,24,{"$f":"\"Monthly TDS amount  required in the next  \"&PERSONAL!H21&\" month(s)\"","v":"Monthly TDS amount  required in the next  3 month(s)"},null,null,null,null,null,null,null,null,null,null,null,null,null,null,null,null,{"$f":"IF(R70<1,0,R70/PERSONAL!H21)","v":0}]
[null,{"$f":"FACE!D1&\" version\"","v":"2023 December 21 version"}]
[null,{"$f":"\"True copy, Counter signed by \"&CUSTOMISE!H24&\", \"&CUSTOMISE!H26","v":"True copy, Counter signed by , "},null,null,null,null,null,null,null,null,null,null,null,null,null,null,null,null,null,null,null,{"$f":"PERSONAL!H4&\", \"&PERSONAL!H6","v":", "},"10 ലേക്ക് ROUND  ചെയ്ത നികുതി സംഖ്യയാണ് ശരിയായ നികുതി. "]
[null,{"$f":"\"Place: \"&PERSONAL!H11","v":"Place: 0"},null,null,null,null,null,null,null,null,null,null,null,null,"http://babuvadukkumchery.blogspot.com",null,null,null,null,null,null,null,"ROUND  ചെയ്യാത്ത തുക ഇവിടെ വെറുതെ  അറിവിലേക്കായി നല്‍കീ എന്നേ കരുതേണ്ടൂ "]
[null,"Date :",null,{"$f":"TEXT(TODAY(),\"dd/mm/yyyy\")","v":"05/02/2024"}]
[null,{"$f":"IF(print!P9=\"ANTICIPATORY TAX CALCULATOR\",\"DETAILS OF EXPECTED SALARY AND DEDUCTIONS  FOR THE FINANCIAL YEAR 2023-24\",\"DETAILS OF  SALARY AND DEDUCTIONS  FOR THE FINANCIAL YEAR 2023-24\")","v":"DETAILS OF EXPECTED SALARY AND DEDUCTIONS  FOR THE FINANCIAL YEAR 2023-24"}]
[null,null,null,{"$f":"IF('det.sal input'!$B$6=\"pension\",\"PENSION RECEIPTS\",\"SALARY RECEIPTS\")","v":"SALARY RECEIPTS"},null,null,null,null,null,null,null,null,"DEDUCTIONS FROM OFFICE"]
[null," For the Month",null,"Pay /Pension","AGP","DA","HRA",{"$f":"UPPER('det.sal input'!H6)","v":"?"},{"$f":"UPPER('det.sal input'!I6)","v":"?"},{"$f":"UPPER('det.sal input'!J6)","v":"?"},{"$f":"UPPER('det.sal input'!K6)","v":"?"},"Total",{"$f":"'det.sal input'!M6","v":"PF"},{"$f":"'det.sal input'!N6","v":"SLI"},{"$f":"'det.sal input'!O6","v":"GI"},"LIC/PLI","TDS",{"$f":"UPPER('det.sal input'!R6&\"+ \"&'det.sal input'!T6)","v":"?+ ?"},{"$f":"'det.sal input'!S6","v":"Donation - Office deduction only 80 G"},{"$f":"'det.sal input'!U6","v":" (NPS)"},{"$f":"'det.sal input'!V6","v":"MEDISEP (S-80 D)"},{"$f":"'det.sal input'!W6","v":"TOTAL DEDUCTIONS"}]
[null,{"$f":"IF('det.sal input'!$B$6=\"pension\",\"April-23\",\"March-2023\")","v":"March-2023"},null,{"$f":"'det.sal input'!C8","v":0},{"$f":"'det.sal input'!D8","v":0},{"$f":"'det.sal input'!F8","v":0},{"$f":"'det.sal input'!G8","v":0},{"$f":"'det.sal input'!H8","v":0},{"$f":"'det.sal input'!I8","v":0},{"$f":"'det.sal input'!J8","v":0},{"$f":"'det.sal input'!K8","v":0},{"$f":"'det.sal input'!L8","v":0},{"$f":"'det.sal input'!M8","v":0},{"$f":"'det.sal input'!N8","v":0},{"$f":"'det.sal input'!O8","v":0},{"$f":"'det.sal input'!P8","v":0},{"$f":"'det.sal input'!Q8","v":0},{"$f":"'det.sal input'!R8+'det.sal input'!T8","v":0},{"$f":"'det.sal input'!S8","v":0},{"$f":"'det.sal input'!U8","v":0},{"$f":"'det.sal input'!V8","v":0},{"$f":"'det.sal input'!W8","v":0}]
[null,{"$f":"IF('det.sal input'!$B$6=\"pension\",\"May\",\"April\")","v":"April"},null,{"$f":"'det.sal input'!C9","v":0},{"$f":"'det.sal input'!D9","v":0},{"$f":"'det.sal input'!F9","v":0},{"$f":"'det.sal input'!G9","v":0},{"$f":"'det.sal input'!H9","v":0},{"$f":"'det.sal input'!I9","v":0},{"$f":"'det.sal input'!J9","v":0},{"$f":"'det.sal input'!K9","v":0},{"$f":"'det.sal input'!L9","v":0},{"$f":"'det.sal input'!M9","v":0},{"$f":"'det.sal input'!N9","v":0},{"$f":"'det.sal input'!O9","v":0},{"$f":"'det.sal input'!P9","v":0},{"$f":"'det.sal input'!Q9","v":0},{"$f":"'det.sal input'!R9+'det.sal input'!T9","v":0},{"$f":"'det.sal input'!S9","v":0},{"$f":"'det.sal input'!U9","v":0},{"$f":"'det.sal input'!V9","v":0},{"$f":"'det.sal input'!W9","v":0}]
[null,{"$f":"'det.sal input'!B10","v":"May"},null,{"$f":"'det.sal input'!C10","v":0},{"$f":"'det.sal input'!D10","v":0},{"$f":"'det.sal input'!F10","v":0},{"$f":"'det.sal input'!G10","v":0},{"$f":"'det.sal input'!H10","v":0},{"$f":"'det.sal input'!I10","v":0},{"$f":"'det.sal input'!J10","v":0},{"$f":"'det.sal input'!K10","v":0},{"$f":"'det.sal input'!L10","v":0},{"$f":"'det.sal input'!M10","v":0},{"$f":"'det.sal input'!N10","v":0},{"$f":"'det.sal input'!O10","v":0},{"$f":"'det.sal input'!P10","v":0},{"$f":"'det.sal input'!Q10","v":0},{"$f":"'det.sal input'!R10+'det.sal input'!T10","v":0},{"$f":"'det.sal input'!S10","v":0},{"$f":"'det.sal input'!U10","v":0},{"$f":"'det.sal input'!V10","v":0},{"$f":"'det.sal input'!W10","v":0}]
[null,{"$f":"'det.sal input'!B11","v":"June"},null,{"$f":"'det.sal input'!C11","v":0},{"$f":"'det.sal input'!D11","v":0},{"$f":"'det.sal input'!F11","v":0},{"$f":"'det.sal input'!G11","v":0},{"$f":"'det.sal input'!H11","v":0},{"$f":"'det.sal input'!I11","v":0},{"$f":"'det.sal input'!J11","v":0},{"$f":"'det.sal input'!K11","v":0},{"$f":"'det.sal input'!L11","v":0},{"$f":"'det.sal input'!M11","v":0},{"$f":"'det.sal input'!N11","v":0},{"$f":"'det.sal input'!O11","v":0},{"$f":"'det.sal input'!P11","v":0},{"$f":"'det.sal input'!Q11","v":0},{"$f":"'det.sal input'!R11+'det.sal input'!T11","v":0},{"$f":"'det.sal input'!S11","v":0},{"$f":"'det.sal input'!U11","v":0},{"$f":"'det.sal input'!V11","v":0},{"$f":"'det.sal input'!W11","v":0}]
[null,{"$f":"'det.sal input'!B12","v":"July"},null,{"$f":"'det.sal input'!C12","v":0},{"$f":"'det.sal input'!D12","v":0},{"$f":"'det.sal input'!F12","v":0},{"$f":"'det.sal input'!G12","v":0},{"$f":"'det.sal input'!H12","v":0},{"$f":"'det.sal input'!I12","v":0},{"$f":"'det.sal input'!J12","v":0},{"$f":"'det.sal input'!K12","v":0},{"$f":"'det.sal input'!L12","v":0},{"$f":"'det.sal input'!M12","v":0},{"$f":"'det.sal input'!N12","v":0},{"$f":"'det.sal input'!O12","v":0},{"$f":"'det.sal input'!P12","v":0},{"$f":"'det.sal input'!Q12","v":0},{"$f":"'det.sal input'!R12+'det.sal input'!T12","v":0},{"$f":"'det.sal input'!S12","v":0},{"$f":"'det.sal input'!U12","v":0},{"$f":"'det.sal input'!V12","v":0},{"$f":"'det.sal input'!W12","v":0}]
[null,{"$f":"'det.sal input'!B13","v":"August"},null,{"$f":"'det.sal input'!C13","v":0},{"$f":"'det.sal input'!D13","v":0},{"$f":"'det.sal input'!F13","v":0},{"$f":"'det.sal input'!G13","v":0},{"$f":"'det.sal input'!H13","v":0},{"$f":"'det.sal input'!I13","v":0},{"$f":"'det.sal input'!J13","v":0},{"$f":"'det.sal input'!K13","v":0},{"$f":"'det.sal input'!L13","v":0},{"$f":"'det.sal input'!M13","v":0},{"$f":"'det.sal input'!N13","v":0},{"$f":"'det.sal input'!O13","v":0},{"$f":"'det.sal input'!P13","v":0},{"$f":"'det.sal input'!Q13","v":0},{"$f":"'det.sal input'!R13+'det.sal input'!T13","v":0},{"$f":"'det.sal input'!S13","v":0},{"$f":"'det.sal input'!U13","v":0},{"$f":"'det.sal input'!V13","v":0},{"$f":"'det.sal input'!W13","v":0}]
[null,{"$f":"'det.sal input'!B14","v":"September"},null,{"$f":"'det.sal input'!C14","v":0},{"$f":"'det.sal input'!D14","v":0},{"$f":"'det.sal input'!F14","v":0},{"$f":"'det.sal input'!G14","v":0},{"$f":"'det.sal input'!H14","v":0},{"$f":"'det.sal input'!I14","v":0},{"$f":"'det.sal input'!J14","v":0},{"$f":"'det.sal input'!K14","v":0},{"$f":"'det.sal input'!L14","v":0},{"$f":"'det.sal input'!M14","v":0},{"$f":"'det.sal input'!N14","v":0},{"$f":"'det.sal input'!O14","v":0},{"$f":"'det.sal input'!P14","v":0},{"$f":"'det.sal input'!Q14","v":0},{"$f":"'det.sal input'!R14+'det.sal input'!T14","v":0},{"$f":"'det.sal input'!S14","v":0},{"$f":"'det.sal input'!U14","v":0},{"$f":"'det.sal input'!V14","v":0},{"$f":"'det.sal input'!W14","v":0}]
[{"$f":"FACE!D1","v":"2023 December 21"},{"$f":"'det.sal input'!B15","v":"October"},null,{"$f":"'det.sal input'!C15","v":0},{"$f":"'det.sal input'!D15","v":0},{"$f":"'det.sal input'!F15","v":0},{"$f":"'det.sal input'!G15","v":0},{"$f":"'det.sal input'!H15","v":0},{"$f":"'det.sal input'!I15","v":0},{"$f":"'det.sal input'!J15","v":0},{"$f":"'det.sal input'!K15","v":0},{"$f":"'det.sal input'!L15","v":0},{"$f":"'det.sal input'!M15","v":0},{"$f":"'det.sal input'!N15","v":0},{"$f":"'det.sal input'!O15","v":0},{"$f":"'det.sal input'!P15","v":0},{"$f":"'det.sal input'!Q15","v":0},{"$f":"'det.sal input'!R15+'det.sal input'!T15","v":0},{"$f":"'det.sal input'!S15","v":0},{"$f":"'det.sal input'!U15","v":0},{"$f":"'det.sal input'!V15","v":0},{"$f":"'det.sal input'!W15","v":0}]
[null,{"$f":"'det.sal input'!B16","v":"November"},null,{"$f":"'det.sal input'!C16","v":0},{"$f":"'det.sal input'!D16","v":0},{"$f":"'det.sal input'!F16","v":0},{"$f":"'det.sal input'!G16","v":0},{"$f":"'det.sal input'!H16","v":0},{"$f":"'det.sal input'!I16","v":0},{"$f":"'det.sal input'!J16","v":0},{"$f":"'det.sal input'!K16","v":0},{"$f":"'det.sal input'!L16","v":0},{"$f":"'det.sal input'!M16","v":0},{"$f":"'det.sal input'!N16","v":0},{"$f":"'det.sal input'!O16","v":0},{"$f":"'det.sal input'!P16","v":0},{"$f":"'det.sal input'!Q16","v":0},{"$f":"'det.sal input'!R16+'det.sal input'!T16","v":0},{"$f":"'det.sal input'!S16","v":0},{"$f":"'det.sal input'!U16","v":0},{"$f":"'det.sal input'!V16","v":0},{"$f":"'det.sal input'!W16","v":0}]
[null,{"$f":"'det.sal input'!B17","v":"December"},null,{"$f":"'det.sal input'!C17","v":0},{"$f":"'det.sal input'!D17","v":0},{"$f":"'det.sal input'!F17","v":0},{"$f":"'det.sal input'!G17","v":0},{"$f":"'det.sal input'!H17","v":0},{"$f":"'det.sal input'!I17","v":0},{"$f":"'det.sal input'!J17","v":0},{"$f":"'det.sal input'!K17","v":0},{"$f":"'det.sal input'!L17","v":0},{"$f":"'det.sal input'!M17","v":0},{"$f":"'det.sal input'!N17","v":0},{"$f":"'det.sal input'!O17","v":0},{"$f":"'det.sal input'!P17","v":0},{"$f":"'det.sal input'!Q17","v":0},{"$f":"'det.sal input'!R17+'det.sal input'!T17","v":0},{"$f":"'det.sal input'!S17","v":0},{"$f":"'det.sal input'!U17","v":0},{"$f":"'det.sal input'!V17","v":0},{"$f":"'det.sal input'!W17","v":0}]
[null,{"$f":"'det.sal input'!B18","v":"Jan- 2024"},null,{"$f":"'det.sal input'!C18","v":0},{"$f":"'det.sal input'!D18","v":0},{"$f":"'det.sal input'!F18","v":0},{"$f":"'det.sal input'!G18","v":0},{"$f":"'det.sal input'!H18","v":0},{"$f":"'det.sal input'!I18","v":0},{"$f":"'det.sal input'!J18","v":0},{"$f":"'det.sal input'!K18","v":0},{"$f":"'det.sal input'!L18","v":0},{"$f":"'det.sal input'!M18","v":0},{"$f":"'det.sal input'!N18","v":0},{"$f":"'det.sal input'!O18","v":0},{"$f":"'det.sal input'!P18","v":0},{"$f":"'det.sal input'!Q18","v":0},{"$f":"'det.sal input'!R18+'det.sal input'!T18","v":0},{"$f":"'det.sal input'!S18","v":0},{"$f":"'det.sal input'!U18","v":0},{"$f":"'det.sal input'!V18","v":0},{"$f":"'det.sal input'!W18","v":0}]
[null,{"$f":"'det.sal input'!B19","v":"Feb-2024"},null,{"$f":"'det.sal input'!C19","v":0},{"$f":"'det.sal input'!D19","v":0},{"$f":"'det.sal input'!F19","v":0},{"$f":"'det.sal input'!G19","v":0},{"$f":"'det.sal input'!H19","v":0},{"$f":"'det.sal input'!I19","v":0},{"$f":"'det.sal input'!J19","v":0},{"$f":"'det.sal input'!K19","v":0},{"$f":"'det.sal input'!L19","v":0},{"$f":"'det.sal input'!M19","v":0},{"$f":"'det.sal input'!N19","v":0},{"$f":"'det.sal input'!O19","v":0},{"$f":"'det.sal input'!P19","v":0},{"$f":"'det.sal input'!Q19+R70","v":0},{"$f":"'det.sal input'!R19+'det.sal input'!T19","v":0},{"$f":"'det.sal input'!S19","v":0},{"$f":"'det.sal input'!U19","v":0},{"$f":"'det.sal input'!V19","v":0},{"$f":"'det.sal input'!W19","v":0}]
[null,"Fest. All",null,{"$f":"'det.sal input'!C20","v":0},null,null,null,null,null,null,null,{"$f":"'det.sal input'!L20","v":0},null,null,null,null,null,null,{"$f":"'det.sal input'!S20","v":0}]
[null,"Arrear","PF",{"$f":"'det.sal input'!C21","v":0},{"$f":"'det.sal input'!D21","v":0},{"$f":"'det.sal input'!F21","v":0},{"$f":"'det.sal input'!G21","v":0},{"$f":"'det.sal input'!H21","v":0},{"$f":"'det.sal input'!I21","v":0},{"$f":"'det.sal input'!J21","v":0},{"$f":"'det.sal input'!K21","v":0},{"$f":"'det.sal input'!L21","v":0},{"$f":"'det.sal input'!M21","v":0},{"$f":"'det.sal input'!N21","v":0},{"$f":"'det.sal input'!O21","v":0},{"$f":"'det.sal input'!P21","v":0},{"$f":"'det.sal input'!Q21","v":0},{"$f":"'det.sal input'!R21+'det.sal input'!T21","v":0},{"$f":"'det.sal input'!S21","v":0},{"$f":"'det.sal input'!U21","v":0},null,{"$f":"'det.sal input'!W21","v":0}]
[null,null,"CASH/NPS",{"$f":"'det.sal input'!C22","v":0},{"$f":"'det.sal input'!D22","v":0},{"$f":"'det.sal input'!F22","v":0},{"$f":"'det.sal input'!G22","v":0},{"$f":"'det.sal input'!H22","v":0},{"$f":"'det.sal input'!I22","v":0},{"$f":"'det.sal input'!J22","v":0},{"$f":"'det.sal input'!K22","v":0},{"$f":"'det.sal input'!L22","v":0},{"$f":"'det.sal input'!M22","v":0},{"$f":"'det.sal input'!N22","v":0},{"$f":"'det.sal input'!O22","v":0},{"$f":"'det.sal input'!P22","v":0},{"$f":"'det.sal input'!Q22","v":0},{"$f":"'det.sal input'!R22+'det.sal input'!T22","v":0},{"$f":"'det.sal input'!S22","v":0},{"$f":"'det.sal input'!U22","v":0},null,{"$f":"'det.sal input'!W22","v":0}]
[null,"Leave surrender",null,{"$f":"'det.sal input'!C23","v":0},{"$f":"'det.sal input'!D23","v":0},{"$f":"'det.sal input'!F23","v":0},{"$f":"'det.sal input'!G23","v":0},{"$f":"'det.sal input'!H23","v":0},{"$f":"'det.sal input'!I23","v":0},{"$f":"'det.sal input'!J23","v":0},{"$f":"'det.sal input'!K23","v":0},{"$f":"'det.sal input'!L23","v":0},{"$f":"'det.sal input'!M23","v":0},{"$f":"'det.sal input'!N23","v":0},{"$f":"'det.sal input'!O23","v":0},{"$f":"'det.sal input'!P23","v":0},{"$f":"'det.sal input'!Q23","v":0},{"$f":"'det.sal input'!R23+'det.sal input'!T23","v":0},{"$f":"'det.sal input'!S23","v":0},{"$f":"'det.sal input'!U23","v":0},null,{"$f":"'det.sal input'!W23","v":0}]
[null,"Deferred salary Arrear",null,{"$f":"'det.sal input'!C25","v":0},{"$f":"'det.sal input'!D24","v":0},{"$f":"'det.sal input'!F24","v":0},{"$f":"'det.sal input'!G24","v":0},{"$f":"'det.sal input'!H24","v":0},{"$f":"'det.sal input'!I24","v":0},{"$f":"'det.sal input'!J24","v":0},{"$f":"'det.sal input'!K24","v":0},{"$f":"'det.sal input'!L25","v":0},{"$f":"'det.sal input'!M24","v":0},{"$f":"'det.sal input'!N24","v":0},{"$f":"'det.sal input'!O24","v":0},{"$f":"'det.sal input'!P24","v":0},{"$f":"'det.sal input'!Q24","v":0},{"$f":"'det.sal input'!R24+'det.sal input'!T24","v":0},{"$f":"'det.sal input'!S24","v":0},{"$f":"'det.sal input'!U24","v":0},null,{"$f":"'det.sal input'!W24","v":0}]
[null,"Total *",null,{"$f":"'det.sal input'!C26","v":0},{"$f":"'det.sal input'!D26","v":0},{"$f":"'det.sal input'!F26","v":0},{"$f":"'det.sal input'!G26","v":0},{"$f":"'det.sal input'!H26","v":0},{"$f":"'det.sal input'!I26","v":0},{"$f":"'det.sal input'!J26","v":0},{"$f":"'det.sal input'!K26","v":0},{"$f":"'det.sal input'!L26","v":0},{"$f":"'det.sal input'!M26","v":0},{"$f":"'det.sal input'!N26","v":0},{"$f":"'det.sal input'!O26","v":0},{"$f":"'det.sal input'!P26","v":0},{"$f":"SUM(Q79:Q89)+SUM(Q91:Q95)+Q90","v":0},{"$f":"'det.sal input'!R26+'det.sal input'!T26","v":0},{"$f":"'det.sal input'!S26","v":0},{"$f":"'det.sal input'!U26","v":0},{"$f":"SUM(U79:U95)","v":0},{"$f":"SUM(V79:V95)","v":0}]
[null,{"$f":"IF('det.sal input'!C24=\"\",\"\",\"* Total includes other office receipts or refunds\")","v":""}]
[null,null,null,{"$f":"IF(#REF!<0,\"Refund of salary\",\"Other receipts from office\")","v":{"$error":"#REF!"}},null,null,null,null,null,null,null,null,null,null,null,null,null,{"$f":"ROUND(W69,-1)","v":0}]
[]
[]
[]
[]
[]
[]
[]
[]
[]
[]
[]
[]
[]
[]
[]
[]
[]
[]
[]
[]
[]
[]
[]
[]
[]
[]
[]
[]
[]
[]
[]
[]
[]
[]
[]
[]
[]
[]
[]
[]
[]
[]
[]
[]
[]
[]
[]
[]
[]
[]
[]
[]
[]
[]
[]
[]
[]
[]
[]
[]
[]
[]
[]
[]
[]
[]
[]
[]
[]
[]
[]
[]
[]
[]
[]
[]
[]
[]
[]
[]
[]
[]
[]
[]
[]
[]
[]
[]
[]
[]
[]
[]
[]
[]
[]
[]
[]
[]
[]
[]
[]
[]
[]
[]
[]
[]
[]
[]
[]
[]
[]
[]
[]
[]
[]
[]
[]
[]
[]
[]
[]
[]
[]
[null,null,null,null,null,null,null,null,null,null,null,null,null,null,null,null,null,null,null,null,null,null,null,null,null,null,null,null,null,null,"Male",{"$f":"IF(AND(R59>200000,R59<=500000),(R59-200000)*0.1,IF(AND(R59>500000,R59<=1000000),30000+(R59-500000)*0.2,IF(R59>1000000,130000+(R59-1000000)*0.3,\"Nil\")))","v":"Nil"}]
[null,null,null,null,null,null,null,null,null,null,null,null,null,null,null,null,null,null,null,null,null,null,null,null,null,null,null,null,null,null,"Female",{"$f":"IF(AND(R59>200000,R59<=500000),(R59-200000)*0.1,IF(AND(R59>500000,R59<=1000000),30000+(R59-500000)*0.2,IF(R59>1000000,130000+(R59-1000000)*0.3,\"Nil\")))","v":"Nil"}]
[null,null,null,null,null,null,null,null,null,null,null,null,null,null,null,null,null,null,null,null,null,null,null,null,null,null,null,null,null,null,"Senior",{"$f":"IF(AND(R59>250000,R59<=500000),(R59-250000)*0.1,IF(AND(R59>500000,R59<=1000000),25000+(R59-500000)*0.2,IF(R59>1000000,125000+(R59-1000000)*0.3,\"Nil\")))","v":"Nil"}]
[null,null,null,null,null,null,null,null,null,null,null,null,null,null,null,null,null,null,null,null,null,null,null,null,null,null,null,null,null,null,"Senior2",{"$f":"IF(AND(R59>500000,R59<=1000000),(R59-500000)*0.2,IF(R59>1000000,100000+(R59-1000000)*0.3,\"Nil\"))","v":"Nil"}]
[]
[]
[]
[null,null,null,null,null,null,null,null,null,null,null,null,null,null,null,null,null,null,null,null,null,null,null,null,null,null,null,null,null,null,{"$f":"IF(O30<>\"Nil\",\"Life Insurance Premum\",\"\")","v":"Life Insurance Premum"},{"$f":"IF(O30<>\"Nil\",O30,\"\")","v":0},{"$f":"IF(ROW()-ROW(two)+1>ROWS(one)-COUNTBLANK(one),\"\",INDIRECT(ADDRESS(SMALL((IF(one<>\"\",ROW(one),ROW()+ROWS(one))),ROW()-ROW(two)+1),COLUMN(one),4)))","v":{"$error":"#REF!"}},{"$f":"IF(AG229<>\"\",VLOOKUP(AG229,AE229:AF242,2,FALSE),\"\")","v":{"$error":"#REF!"}}]
[null,null,null,null,null,null,null,null,null,null,null,null,null,null,null,null,null,null,null,null,null,null,null,null,null,null,null,null,null,null,{"$f":"IF(#REF!<>\"Nil\",\"Purchase of NSC\",\"\")","v":{"$error":"#REF!"}},{"$f":"IF(#REF!<>\"Nil\",#REF!,\"\")","v":{"$error":"#REF!"}},{"$f":"IF(ROW()-ROW(two)+1>ROWS(one)-COUNTBLANK(one),\"\",INDIRECT(ADDRESS(SMALL((IF(one<>\"\",ROW(one),ROW()+ROWS(one))),ROW()-ROW(two)+1),COLUMN(one),4)))","v":{"$error":"#REF!"}},{"$f":"IF(AG230<>\"\",VLOOKUP(AG230,AE230:AF245,2,FALSE),\"\")","v":{"$error":"#REF!"}}]
[null,null,null,null,null,null,null,null,null,null,null,null,null,null,null,null,null,null,null,null,null,null,null,null,null,null,null,null,null,null,{"$f":"IF(O32<>\"Nil\",\"State Life Insurance (SLI)\",\"\")","v":"State Life Insurance (SLI)"},{"$f":"IF(O32<>\"Nil\",O32,\"\")","v":0},{"$f":"IF(ROW()-ROW(two)+1>ROWS(one)-COUNTBLANK(one),\"\",INDIRECT(ADDRESS(SMALL((IF(one<>\"\",ROW(one),ROW()+ROWS(one))),ROW()-ROW(two)+1),COLUMN(one),4)))","v":{"$error":"#REF!"}},{"$f":"IF(AG231<>\"\",VLOOKUP(AG231,AE231:AF246,2,FALSE),\"\")","v":{"$error":"#REF!"}}]
[null,null,null,null,null,null,null,null,null,null,null,null,null,null,null,null,null,null,null,null,null,null,null,null,null,null,null,null,null,null,{"$f":"IF(O33<>\"Nil\",\"Group Insurance Scheme (GIS)\",\"\")","v":"Group Insurance Scheme (GIS)"},{"$f":"IF(O33<>\"Nil\",O33,\"\")","v":0},{"$f":"IF(ROW()-ROW(two)+1>ROWS(one)-COUNTBLANK(one),\"\",INDIRECT(ADDRESS(SMALL((IF(one<>\"\",ROW(one),ROW()+ROWS(one))),ROW()-ROW(two)+1),COLUMN(one),4)))","v":{"$error":"#REF!"}},{"$f":"IF(AG232<>\"\",VLOOKUP(AG232,AE232:AF247,2,FALSE),\"\")","v":{"$error":"#REF!"}}]
[null,null,null,null,null,null,null,null,null,null,null,null,null,null,null,null,null,null,null,null,null,null,null,null,null,null,null,null,null,null,{"$f":"IF(#REF!<>\"Nil\",\"Group Personal Accident Insurance (GPAIS)\",\"\")","v":{"$error":"#REF!"}},{"$f":"IF(#REF!<>\"Nil\",#REF!,\"\")","v":{"$error":"#REF!"}},{"$f":"IF(ROW()-ROW(two)+1>ROWS(one)-COUNTBLANK(one),\"\",INDIRECT(ADDRESS(SMALL((IF(one<>\"\",ROW(one),ROW()+ROWS(one))),ROW()-ROW(two)+1),COLUMN(one),4)))","v":{"$error":"#REF!"}},{"$f":"IF(AG233<>\"\",VLOOKUP(AG233,AE233:AF248,2,FALSE),\"\")","v":{"$error":"#REF!"}}]
[null,null,null,null,null,null,null,null,null,null,null,null,null,null,null,null,null,null,null,null,null,null,null,null,null,null,null,null,null,null,{"$f":"IF(O34<>\"Nil\",D34,\"\")","v":"Life Insurence  salary deduction"},{"$f":"IF(O34<>\"Nil\",O34,\"\")","v":0},{"$f":"IF(ROW()-ROW(two)+1>ROWS(one)-COUNTBLANK(one),\"\",INDIRECT(ADDRESS(SMALL((IF(one<>\"\",ROW(one),ROW()+ROWS(one))),ROW()-ROW(two)+1),COLUMN(one),4)))","v":{"$error":"#REF!"}},{"$f":"IF(AG234<>\"\",VLOOKUP(AG234,AE234:AF249,2,FALSE),\"\")","v":{"$error":"#REF!"}}]
[null,null,null,null,null,null,null,null,null,null,null,null,null,null,null,null,null,null,null,null,null,null,null,null,null,null,null,null,null,null,{"$f":"IF(O35<>\"Nil\",\"Provident Fund\",\"\")","v":"Provident Fund"},{"$f":"IF(O35<>\"Nil\",O35,\"\")","v":0},{"$f":"IF(ROW()-ROW(two)+1>ROWS(one)-COUNTBLANK(one),\"\",INDIRECT(ADDRESS(SMALL((IF(one<>\"\",ROW(one),ROW()+ROWS(one))),ROW()-ROW(two)+1),COLUMN(one),4)))","v":{"$error":"#REF!"}},{"$f":"IF(AG235<>\"\",VLOOKUP(AG235,AE235:AF249,2,FALSE),\"\")","v":{"$error":"#REF!"}}]
[null,null,null,null,null,null,null,null,null,null,null,null,null,null,null,null,null,null,null,null,null,null,null,null,null,null,null,null,null,null,{"$f":"IF(O38<>\"Nil\",\"Unit Linked Insurance\",\"\")","v":"Unit Linked Insurance"},{"$f":"IF(O38<>\"Nil\",O38,\"\")","v":0},{"$f":"IF(ROW()-ROW(two)+1>ROWS(one)-COUNTBLANK(one),\"\",INDIRECT(ADDRESS(SMALL((IF(one<>\"\",ROW(one),ROW()+ROWS(one))),ROW()-ROW(two)+1),COLUMN(one),4)))","v":{"$error":"#REF!"}},{"$f":"IF(AG236<>\"\",VLOOKUP(AG236,AE236:AF250,2,FALSE),\"\")","v":{"$error":"#REF!"}}]
[null,null,null,null,null,null,null,null,null,null,null,null,null,null,null,null,null,null,null,null,null,null,null,null,null,null,null,null,null,null,{"$f":"IF(#REF!<>\"Nil\",\"Tax Saving Mutual Fund\",\"\")","v":{"$error":"#REF!"}},{"$f":"IF(#REF!<>\"Nil\",#REF!,\"\")","v":{"$error":"#REF!"}},{"$f":"IF(ROW()-ROW(two)+1>ROWS(one)-COUNTBLANK(one),\"\",INDIRECT(ADDRESS(SMALL((IF(one<>\"\",ROW(one),ROW()+ROWS(one))),ROW()-ROW(two)+1),COLUMN(one),4)))","v":{"$error":"#REF!"}},{"$f":"IF(AG237<>\"\",VLOOKUP(AG237,AE237:AF251,2,FALSE),\"\")","v":{"$error":"#REF!"}}]
[null,null,null,null,null,null,null,null,null,null,null,null,null,null,null,null,null,null,null,null,null,null,null,null,null,null,null,null,null,null,{"$f":"IF(O40<>\"Nil\",\"Tuition Fees\",\"\")","v":"Tuition Fees"},{"$f":"IF(O40<>\"Nil\",O40,\"\")","v":0},{"$f":"IF(ROW()-ROW(two)+1>ROWS(one)-COUNTBLANK(one),\"\",INDIRECT(ADDRESS(SMALL((IF(one<>\"\",ROW(one),ROW()+ROWS(one))),ROW()-ROW(two)+1),COLUMN(one),4)))","v":{"$error":"#REF!"}},{"$f":"IF(AG238<>\"\",VLOOKUP(AG238,AE237:AF252,2,FALSE),\"\")","v":{"$error":"#REF!"}}]
[null,null,null,null,null,null,null,null,null,null,null,null,null,null,null,null,null,null,null,null,null,null,null,null,null,null,null,null,null,null,{"$f":"IF(O41<>\"Nil\",\"Housing Loan Repayment\",\"\")","v":"Housing Loan Repayment"},{"$f":"IF(O41<>\"Nil\",O41,\"\")","v":0},{"$f":"IF(ROW()-ROW(two)+1>ROWS(one)-COUNTBLANK(one),\"\",INDIRECT(ADDRESS(SMALL((IF(one<>\"\",ROW(one),ROW()+ROWS(one))),ROW()-ROW(two)+1),COLUMN(one),4)))","v":{"$error":"#REF!"}},{"$f":"IF(AG239<>\"\",VLOOKUP(AG239,AE238:AF252,2,FALSE),\"\")","v":{"$error":"#REF!"}}]
[null,null,null,null,null,null,null,null,null,null,null,null,null,null,null,null,null,null,null,null,null,null,null,null,null,null,null,null,null,null,{"$f":"IF(#REF!<>\"Nil\",\"Eligibleshares & debentures\",\"\")","v":{"$error":"#REF!"}},{"$f":"IF(#REF!<>\"Nil\",#REF!,\"\")","v":{"$error":"#REF!"}},{"$f":"IF(ROW()-ROW(two)+1>ROWS(one)-COUNTBLANK(one),\"\",INDIRECT(ADDRESS(SMALL((IF(one<>\"\",ROW(one),ROW()+ROWS(one))),ROW()-ROW(two)+1),COLUMN(one),4)))","v":{"$error":"#REF!"}},{"$f":"IF(AG240<>\"\",VLOOKUP(AG240,AE238:AF252,2,FALSE),\"\")","v":{"$error":"#REF!"}}]
[null,null,null,null,null,null,null,null,null,null,null,null,null,null,null,null,null,null,null,null,null,null,null,null,null,null,null,null,null,null,{"$f":"IF(#REF!<>\"Nil\",\"Mutual Fund\",\"\")","v":{"$error":"#REF!"}},{"$f":"IF(#REF!<>\"Nil\",#REF!,\"\")","v":{"$error":"#REF!"}},{"$f":"IF(ROW()-ROW(two)+1>ROWS(one)-COUNTBLANK(one),\"\",INDIRECT(ADDRESS(SMALL((IF(one<>\"\",ROW(one),ROW()+ROWS(one))),ROW()-ROW(two)+1),COLUMN(one),4)))","v":{"$error":"#REF!"}},{"$f":"IF(AG241<>\"\",VLOOKUP(AG241,AE239:AF252,2,FALSE),\"\")","v":{"$error":"#REF!"}}]
[null,null,null,null,null,null,null,null,null,null,null,null,null,null,null,null,null,null,null,null,null,null,null,null,null,null,null,null,null,null,{"$f":"IF(#REF!<>\"Nil\",#REF!,\"\")","v":{"$error":"#REF!"}},{"$f":"IF(#REF!<>\"Nil\",#REF!,\"\")","v":{"$error":"#REF!"}},{"$f":"IF(ROW()-ROW(two)+1>ROWS(one)-COUNTBLANK(one),\"\",INDIRECT(ADDRESS(SMALL((IF(one<>\"\",ROW(one),ROW()+ROWS(one))),ROW()-ROW(two)+1),COLUMN(one),4)))","v":{"$error":"#REF!"}},{"$f":"IF(AG242<>\"\",VLOOKUP(AG242,AE240:AF252,2,FALSE),\"\")","v":{"$error":"#REF!"}}]
[null,null,null,null,null,null,null,null,null,null,null,null,null,null,null,null,null,null,null,null,null,null,null,null,null,null,null,null,null,null,null,null,{"$f":"IF(ROW()-ROW(two)+1>ROWS(one)-COUNTBLANK(one),\"\",INDIRECT(ADDRESS(SMALL((IF(one<>\"\",ROW(one),ROW()+ROWS(one))),ROW()-ROW(two)+1),COLUMN(one),4)))","v":""},{"$f":"IF(AG243<>\"\",VLOOKUP(AG243,AE241:AF252,2,FALSE),\"\")","v":""}]
[null,null,null,null,null,null,null,null,null,null,null,null,null,null,null,null,null,null,null,null,null,null,null,null,null,null,null,null,null,null,null,null,{"$f":"IF(ROW()-ROW(two)+1>ROWS(one)-COUNTBLANK(one),\"\",INDIRECT(ADDRESS(SMALL((IF(one<>\"\",ROW(one),ROW()+ROWS(one))),ROW()-ROW(two)+1),COLUMN(one),4)))","v":""},{"$f":"IF(AG244<>\"\",VLOOKUP(AG244,AE242:AF253,2,FALSE),\"\")","v":""}]
[]
[]
[null,null,null,null,null,null,null,null,null,null,null,null,null,null,null,null,null,null,null,null,null,null,null,null,null,null,null,null,null,null,{"$f":"IF('new statement'!O49<>\"Nil\",\"Mediclaim Policies (Sec 80D)\",\"\")","v":"Mediclaim Policies (Sec 80D)"},{"$f":"IF(AE247<>\"\",O49,\"\")","v":0},{"$f":"IF(ROW()-ROW(four)+1>ROWS(three)-COUNTBLANK(three),\"\",INDIRECT(ADDRESS(SMALL((IF(three<>\"\",ROW(three),ROW()+ROWS(three))),ROW()-ROW(four)+1),COLUMN(three),4)))","v":{"$error":"#REF!"}},{"$f":"IF(ROW()-ROW(fouramt)+1>ROWS(threeamt)-COUNTBLANK(threeamt),\"\",INDIRECT(ADDRESS(SMALL((IF(threeamt<>\"\",ROW(threeamt),ROW()+ROWS(threeamt))),ROW()-ROW(fouramt)+1),COLUMN(threeamt),4)))","v":{"$error":"#REF!"}}]
[null,null,null,null,null,null,null,null,null,null,null,null,null,null,null,null,null,null,null,null,null,null,null,null,null,null,null,null,null,null,{"$f":"IF('new statement'!O50<>\"Nil\",\"Medical Treatment Mentally or Physically handicapped (Sec-80DD)\",\"\")","v":"Medical Treatment Mentally or Physically handicapped (Sec-80DD)"},{"$f":"IF(AE248<>\"\",O50,\"\")","v":0},{"$f":"IF(ROW()-ROW(four)+1>ROWS(three)-COUNTBLANK(three),\"\",INDIRECT(ADDRESS(SMALL((IF(three<>\"\",ROW(three),ROW()+ROWS(three))),ROW()-ROW(four)+1),COLUMN(three),4)))","v":{"$error":"#REF!"}},{"$f":"IF(ROW()-ROW(fouramt)+1>ROWS(threeamt)-COUNTBLANK(threeamt),\"\",INDIRECT(ADDRESS(SMALL((IF(threeamt<>\"\",ROW(threeamt),ROW()+ROWS(threeamt))),ROW()-ROW(fouramt)+1),COLUMN(threeamt),4)))","v":{"$error":"#REF!"}}]
[null,null,null,null,null,null,null,null,null,null,null,null,null,null,null,null,null,null,null,null,null,null,null,null,null,null,null,null,null,null,{"$f":"IF('new statement'!#REF!<>\"Nil\",\"Expenditure on Medical Treatment(Sec-80DDB)\",\"\")","v":{"$error":"#REF!"}},{"$f":"IF(AE249<>\"\",#REF!,\"\")","v":{"$error":"#REF!"}},{"$f":"IF(ROW()-ROW(four)+1>ROWS(three)-COUNTBLANK(three),\"\",INDIRECT(ADDRESS(SMALL((IF(three<>\"\",ROW(three),ROW()+ROWS(three))),ROW()-ROW(four)+1),COLUMN(three),4)))","v":{"$error":"#REF!"}},{"$f":"IF(ROW()-ROW(fouramt)+1>ROWS(threeamt)-COUNTBLANK(threeamt),\"\",INDIRECT(ADDRESS(SMALL((IF(threeamt<>\"\",ROW(threeamt),ROW()+ROWS(threeamt))),ROW()-ROW(fouramt)+1),COLUMN(threeamt),4)))","v":{"$error":"#REF!"}}]
[null,null,null,null,null,null,null,null,null,null,null,null,null,null,null,null,null,null,null,null,null,null,null,null,null,null,null,null,null,null,{"$f":"IF('new statement'!O52<>\"Nil\",\"Interest on Educational Loan (Sec-80 E)\",\"\")","v":"Interest on Educational Loan (Sec-80 E)"},{"$f":"IF(AE250<>\"\",O52,\"\")","v":0},{"$f":"IF(ROW()-ROW(four)+1>ROWS(three)-COUNTBLANK(three),\"\",INDIRECT(ADDRESS(SMALL((IF(three<>\"\",ROW(three),ROW()+ROWS(three))),ROW()-ROW(four)+1),COLUMN(three),4)))","v":{"$error":"#REF!"}},{"$f":"IF(ROW()-ROW(fouramt)+1>ROWS(threeamt)-COUNTBLANK(threeamt),\"\",INDIRECT(ADDRESS(SMALL((IF(threeamt<>\"\",ROW(threeamt),ROW()+ROWS(threeamt))),ROW()-ROW(fouramt)+1),COLUMN(threeamt),4)))","v":{"$error":"#REF!"}}]
[null,null,null,null,null,null,null,null,null,null,null,null,null,null,null,null,null,null,null,null,null,null,null,null,null,null,null,null,null,null,{"$f":"IF('new statement'!O55<>\"Nil\",\"Donation to Charitable Institutions (Sec-80 G)\",\"\")","v":"Donation to Charitable Institutions (Sec-80 G)"},{"$f":"IF(AE251<>\"\",O55,\"\")","v":0},{"$f":"IF(ROW()-ROW(four)+1>ROWS(three)-COUNTBLANK(three),\"\",INDIRECT(ADDRESS(SMALL((IF(three<>\"\",ROW(three),ROW()+ROWS(three))),ROW()-ROW(four)+1),COLUMN(three),4)))","v":{"$error":"#REF!"}},{"$f":"IF(ROW()-ROW(fouramt)+1>ROWS(threeamt)-COUNTBLANK(threeamt),\"\",INDIRECT(ADDRESS(SMALL((IF(threeamt<>\"\",ROW(threeamt),ROW()+ROWS(threeamt))),ROW()-ROW(fouramt)+1),COLUMN(threeamt),4)))","v":{"$error":"#REF!"}}]
[null,null,null,null,null,null,null,null,null,null,null,null,null,null,null,null,null,null,null,null,null,null,null,null,null,null,null,null,null,null,{"$f":"IF('new statement'!#REF!<>\"Nil\",\"Contribution to Political Parties (Sec-80 GGC)\",\"\")","v":{"$error":"#REF!"}},{"$f":"IF(AE252<>\"\",#REF!,\"\")","v":{"$error":"#REF!"}},{"$f":"IF(ROW()-ROW(four)+1>ROWS(three)-COUNTBLANK(three),\"\",INDIRECT(ADDRESS(SMALL((IF(three<>\"\",ROW(three),ROW()+ROWS(three))),ROW()-ROW(four)+1),COLUMN(three),4)))","v":{"$error":"#REF!"}},{"$f":"IF(ROW()-ROW(fouramt)+1>ROWS(threeamt)-COUNTBLANK(threeamt),\"\",INDIRECT(ADDRESS(SMALL((IF(threeamt<>\"\",ROW(threeamt),ROW()+ROWS(threeamt))),ROW()-ROW(fouramt)+1),COLUMN(threeamt),4)))","v":{"$error":"#REF!"}}]
[null,null,null,null,null,null,null,null,null,null,null,null,null,null,null,null,null,null,null,null,null,null,null,null,null,null,null,null,null,null,{"$f":"IF('new statement'!O56<>\"Nil\",\"Deduction for Handicapped Employees (u/s 80U)\",\"\")","v":"Deduction for Handicapped Employees (u/s 80U)"},{"$f":"IF(AE253<>\"\",O56,\"\")","v":0},{"$f":"IF(ROW()-ROW(four)+1>ROWS(three)-COUNTBLANK(three),\"\",INDIRECT(ADDRESS(SMALL((IF(three<>\"\",ROW(three),ROW()+ROWS(three))),ROW()-ROW(four)+1),COLUMN(three),4)))","v":{"$error":"#REF!"}},{"$f":"IF(ROW()-ROW(fouramt)+1>ROWS(threeamt)-COUNTBLANK(threeamt),\"\",INDIRECT(ADDRESS(SMALL((IF(threeamt<>\"\",ROW(threeamt),ROW()+ROWS(threeamt))),ROW()-ROW(fouramt)+1),COLUMN(threeamt),4)))","v":{"$error":"#REF!"}}]
[]
[null,null,null,null,null,null,null,null,null,null,null,null,null,null,null,null,null,null,null,null,null,null,null,null,null,null,null,null,null,null,{"$f":"IF(ISNUMBER(#REF!),\"Income From House Property\",\"\")","v":""},{"$f":"IF(AE255<>\"\",#REF!,\"\")","v":""},{"$f":"IF(ROW()-ROW(six)+1>ROWS(five)-COUNTBLANK(five),\"\",INDIRECT(ADDRESS(SMALL((IF(five<>\"\",ROW(five),ROW()+ROWS(five))),ROW()-ROW(six)+1),COLUMN(five),4)))","v":{"$error":"#REF!"}},{"$f":"IF(ROW()-ROW(sixamt)+1>ROWS(fiveamt)-COUNTBLANK(fiveamt),\"\",INDIRECT(ADDRESS(SMALL((IF(fiveamt<>\"\",ROW(fiveamt),ROW()+ROWS(fiveamt))),ROW()-ROW(sixamt)+1),COLUMN(fiveamt),4)))","v":{"$error":"#REF!"}}]
[null,null,null,null,null,null,null,null,null,null,null,null,null,null,null,null,null,null,null,null,null,null,null,null,null,null,null,null,null,null,{"$f":"IF(#REF!>0,#REF!,\"\")","v":{"$error":"#REF!"}},{"$f":"IF(AE256<>\"\",#REF!,\"\")","v":{"$error":"#REF!"}},{"$f":"IF(ROW()-ROW(six)+1>ROWS(five)-COUNTBLANK(five),\"\",INDIRECT(ADDRESS(SMALL((IF(five<>\"\",ROW(five),ROW()+ROWS(five))),ROW()-ROW(six)+1),COLUMN(five),4)))","v":{"$error":"#REF!"}},{"$f":"IF(ROW()-ROW(sixamt)+1>ROWS(fiveamt)-COUNTBLANK(fiveamt),\"\",INDIRECT(ADDRESS(SMALL((IF(fiveamt<>\"\",ROW(fiveamt),ROW()+ROWS(fiveamt))),ROW()-ROW(sixamt)+1),COLUMN(fiveamt),4)))","v":{"$error":"#REF!"}}]
[null,null,null,null,null,null,null,null,null,null,null,null,null,null,null,null,null,null,null,null,null,null,null,null,null,null,null,null,null,null,{"$f":"IF(#REF!>0,#REF!,\"\")","v":{"$error":"#REF!"}},{"$f":"IF(AE257<>\"\",#REF!,\"\")","v":{"$error":"#REF!"}},{"$f":"IF(ROW()-ROW(six)+1>ROWS(five)-COUNTBLANK(five),\"\",INDIRECT(ADDRESS(SMALL((IF(five<>\"\",ROW(five),ROW()+ROWS(five))),ROW()-ROW(six)+1),COLUMN(five),4)))","v":{"$error":"#REF!"}},{"$f":"IF(ROW()-ROW(sixamt)+1>ROWS(fiveamt)-COUNTBLANK(fiveamt),\"\",INDIRECT(ADDRESS(SMALL((IF(fiveamt<>\"\",ROW(fiveamt),ROW()+ROWS(fiveamt))),ROW()-ROW(sixamt)+1),COLUMN(fiveamt),4)))","v":{"$error":"#REF!"}}]
[null,null,null,null,null,null,null,null,null,null,null,null,null,null,null,null,null,null,null,null,null,null,null,null,null,null,null,null,null,null,{"$f":"IF(#REF!>0,#REF!,\"\")","v":{"$error":"#REF!"}},{"$f":"IF(AE258<>\"\",#REF!,\"\")","v":{"$error":"#REF!"}},{"$f":"IF(ROW()-ROW(six)+1>ROWS(five)-COUNTBLANK(five),\"\",INDIRECT(ADDRESS(SMALL((IF(five<>\"\",ROW(five),ROW()+ROWS(five))),ROW()-ROW(six)+1),COLUMN(five),4)))","v":""},{"$f":"IF(ROW()-ROW(sixamt)+1>ROWS(fiveamt)-COUNTBLANK(fiveamt),\"\",INDIRECT(ADDRESS(SMALL((IF(fiveamt<>\"\",ROW(fiveamt),ROW()+ROWS(fiveamt))),ROW()-ROW(sixamt)+1),COLUMN(fiveamt),4)))","v":""}]
[]
[]
[null,null,null,null,null,null,null,null,null,null,null,null,null,null,null,null,null,null,null,null,null,null,null,null,null,null,null,null,null,null,{"$f":"IF(AND(R66<>\"Nil\",R67<>\"Nil\"),R66-R67,IF(AND(R66>0,R67=\"Nil\"),R66,IF(AND(R67>0,R66=\"Nil\"),(0-R67),\"Nil\")))","v":0}]

{"sheet":"new statement for PRINT","index":20,"n_rows":261,"n_cols":34,"rows_kept":261,"cut":false,"hidden":false,"merged":[[0,3,0,14],[0,15,0,16],[0,22,0,25],[1,1,1,16],[1,17,1,21],[2,1,2,21],[3,1,3,19],[4,1,4,3],[4,5,4,13],[4,14,4,15],[4,16,4,19],[4,22,6,25],[5,5,5,8],[5,17,5,21],[6,1,11,1],[6,3,6,15],[12,1,16,1],[13,3,13,12],[13,14,13,15],[14,3,14,11],[14,14,14,15],[15,3,15,12],[15,14,15,15],[6,17,6,19],[7,3,7,15],[7,17,7,19],[8,3,8,15],[8,17,8,19],[11,3,11,15],[11,17,11,19],[19,2,19,12],[19,17,19,19],[20,2,20,12],[20,17,20,19],[21,2,21,15],[21,17,21,19],[15,17,15,19],[16,2,16,13],[16,17,16,19],[17,2,17,12],[17,17,17,19],[18,10,18,14],[18,17,18,19],[25,14,25,15],[25,17,25,19],[26,2,26,15],[26,17,26,19],[27,2,27,12],[27,14,27,16],[27,17,27,21],[22,2,22,13],[22,14,22,15],[22,17,22,19],[23,2,23,13],[23,14,23,15],[24,14,24,15],[31,24,31,27],[32,3,32,12],[32,14,32,15],[32,17,32,19],[32,24,32,27],[33,3,33,12],[33,14,33,15],[28,1,34,1],[28,17,28,21],[29,3,29,12],[29,14,29,15],[29,17,29,19],[29,24,29,27],[30,14,30,15],[31,3,31,12],[31,14,31,15],[31,17,31,19],[37,24,37,27],[38,3,38,12],[38,14,38,15],[34,3,34,12],[34,14,34,15],[34,17,34,19],[34,24,34,27],[35,3,35,13],[35,14,35,15],[39,3,39,12],[39,14,39,15],[40,3,40,12],[40,14,40,15],[40,17,40,19],[41,3,41,13],[41,14,41,15],[36,3,36,12],[36,14,36,15],[37,3,37,12],[37,14,37,15],[43,24,43,27],[44,2,44,13],[44,14,44,15],[44,17,44,19],[45,3,45,12],[45,14,45,15],[45,17,45,19],[42,2,42,12],[42,14,42,15],[42,17,42,19],[43,2,43,12],[43,14,43,15],[43,17,43,19],[48,17,48,19],[49,3,49,12],[49,14,49,15],[49,17,49,19],[50,3,50,13],[50,14,50,15],[46,3,46,12],[46,14,46,15],[47,3,47,12],[47,14,47,15],[48,3,48,12],[48,14,48,15],[54,3,54,12],[54,14,54,15],[54,17,54,19],[55,3,55,12],[55,14,55,15],[55,17,55,19],[51,3,51,12],[51,14,51,15],[51,17,51,19],[52,3,52,12],[52,14,52,15],[53,3,53,12],[53,14,53,15],[60,2,60,16],[60,17,60,19],[61,2,61,16],[61,17,61,19],[62,2,62,12],[62,17,62,19],[56,14,56,15],[56,17,56,19],[57,2,57,16],[57,17,57,19],[58,17,58,19],[59,2,59,15],[59,17,59,19],[66,2,66,12],[66,17,66,19],[67,2,67,16],[67,17,67,19],[68,2,68,12],[68,13,68,16],[68,17,68,19],[63,2,63,12],[63,17,63,19],[64,2,64,15],[64,17,64,19],[65,2,65,10],[65,17,65,19],[77,1,77,2],[78,1,78,2],[79,1,79,2],[69,2,69,12],[69,13,69,16],[69,17,69,19],[71,15,71,21],[73,14,73,21],[74,6,74,15],[93,1,93,2],[94,1,94,2],[95,1,95,2],[60,20,60,21],[85,0,95,0],[85,1,85,2],[85,24,85,30],[86,1,86,2],[86,24,86,29],[87,1,87,2],[88,1,88,2],[89,1,89,2],[90,1,90,2],[91,1,92,1],[80,1,80,2],[81,1,81,2],[82,1,82,2],[83,1,83,2],[83,24,83,29],[84,1,84,2],[84,24,84,28],[75,1,75,21],[76,3,76,11],[76,12,76,21]]}
[{"$f":"F5&\" \"& B2","v":"0 ANTICIPATORY INCOME TAX STATEMENT(NEW RATE OPTION)-FINANCIAL YEAR 2023-24 (AY 24-25) "},{"$f":"INVEST!K3","v":0},{"$f":"INVEST!L3","v":0},{"$f":"IF(C1>B1,\"Warning ! Your are in the wrong field. The New Regime option is not suitable for you.  To choose  the economical option, click the green button on the right side\",\"\")","v":""},null,null,null,null,null,null,null,null,null,null,null,{"$f":"IF(D1=\"\",0,1)","v":0}]
[null,{"$f":"IF(print!P9=\"ANTICIPATORY TAX CALCULATOR\",\"ANTICIPATORY INCOME TAX STATEMENT(NEW RATE OPTION)-FINANCIAL YEAR 2023-24 (AY 24-25) \",\"INCOME TAX STATEMENT(NEW RATE OPTION)-FINANCIAL YEAR 2023-24 (AY 24-25)\")","v":"ANTICIPATORY INCOME TAX STATEMENT(NEW RATE OPTION)-FINANCIAL YEAR 2023-24 (AY 24-25) "},null,null,null,null,null,null,null,null,null,null,null,null,null,null,null,{"$f":"CUSTOMISE!H22","v":0},null,null,null,null,2]
[null,{"$f":"PERSONAL!H10","v":"SALARY"},null,null,null,null,null,null,null,null,null,null,null,null,null,null,null,null,null,null,null,null,2]
[]
[null,"Name",null,null,null,{"$f":"PERSONAL!H4","v":0},null,null,null,null,null,null,null,null,"PAN :",null,{"$f":"PERSONAL!H7","v":0},null,null,null,null,null,{"$f":"IF(PERSONAL!H8=\"no\",\"\",IF('det.sal input'!AC39>'det.sal input'!AB38,\"You cannot claim for benifit of living in a rental home [HRA benifit], because rent paid amount is less than 10% of your salary\",\"\"))","v":""}]
[null,"Designation     ",null,null,null,{"$f":"PERSONAL!H6","v":0},null,null,null,null,null,{"$f":"PERSONAL!H5","v":"Below 60 Years"},null,null,null,null,null,"NEW REGIME RATE"]
[null,1,"a","Gross Salary (Excluding interest on arrear salary),  Festival allowance, Bonus,Leave Surrender)(includes Salary, DA, HRA, CCA, Interim Relief, , DA Arrear, Pay Revision Arrear  etc)",null,null,null,null,null,null,null,null,null,null,null,null,":",{"$f":"L96-L91-L94-'arrear det'!K13","v":0},null,null,null,null,null,null,null,null,{"$f":"'det.sal input'!AF29","v":1}]
[null,null,"b","Leave Surrender",null,null,null,null,null,null,null,null,null,null,null,null,":",{"$f":"L94","v":0},null,null,null,null,"medical reimb actual",{"$f":"'det.sal input'!W28","v":0},15000,"excess=",{"$f":"IF(AA7=1,0,IF((X8-Y8)>0,(X8-Y8),0))","v":0}]
[null,null,"c","Festival Allowance / Bonus / Ex-gratia and incentive",null,null,null,null,null,null,null,null,null,null,null,null,":",{"$f":"L91","v":0},null,null,null,null,{"$f":"SUM(R7:T9)","v":0}]
[null,null,"d","Value of perquisites (Iincludes Employer's contribution to NPS, Medical reimb. Taxable portion)",null,null,null,null,null,null,null,null,null,null,null,null,":",null,null,{"$f":"'det.sal input'!W32+'det.sal input'!W33+X8","v":0},null,null,null,null,null,null,"IF((V8-W8)>0,(V8-W8),0))"]
[null,null,"e","Profits in lieu of salary (S17-3)",null,null,null,null,null,null,null,null,null,null,null,null,":",null,null,{"$f":"'det.sal input'!W34","v":0},null,null,null,{"$f":"PERSONAL!H8","v":"NO"}]
[null,null,"f ","Total Salary Income (a+b+c+d+e)",null,null,null,null,null,null,null,null,null,null,null,null,":",{"$f":"SUM(R7:T11)","v":0}]
[null,2,"Deduction towards rent paid ",null,null,null,null,"Not available in New Regime option"]
[null,null,"i)","Actual HRA Received relating to the period",null,null,":",null,null,null,null,null,null,":",{"$f":"IF(X11=\"NO\",\"\",'det.sal input'!AB40)","v":""}]
[null,null,"ii)","Actual Rent paid in excess 1/10th of the salary",null,null,null,null,null,null,null,null,{"$f":"IF(O15=0,\"NIL\",\"\")","v":""},":",{"$f":"IF(X11=\"NO\",\"\",IF(Y15>AA15,Y15-AA15,0))","v":""},null,null,null,null,null,null,null,null,null,{"$f":"'det.sal input'!AB38","v":0},"1/10 of sal=",{"$f":"'det.sal input'!AC39","v":0},{"$f":"IF(Y15>AA15,Y15-AA15,0)","v":0}]
[null,null,"iii)","40% Salary ( For this salary means Basic + DA)",null,null,":",null,null,null,null,null,null,":",{"$f":"IF(X11=\"NO\",\"\",AA16)","v":""},null,null,{"$f":"IF(W2=2,0,(IF(R17=0,\"NIL\",R17)))","v":0},null,null,null,null,null,null,null,"40%sal =",{"$f":"ROUND(('det.sal input'!AB39*0.4),0)","v":0}]
[null,null,{"$f":"IF(PERSONAL!H8=\"no\",\"\",\" (Here, Salary means Basic+DA+AGP only, but include arrear/ surrender values relating to this period.) That is \"&'det.sal input'!R40&\"+\"&'det.sal input'!T40&\"+\"&'det.sal input'!W40&\"\")","v":""},null,null,null,null,null,null,null,null,null,null,null,null,null,":",{"$f":"IF(W2=2,0,MIN(O14:P16))","v":0}]
[null,3,"Balance ( 1- 2)",null,null,null,null,null,null,null,null,null,null,null,null,null,":",{"$f":"R12-R17","v":0}]
[null,4,{"$f":"\" Less Allowance to the extent exempt u/s10   \"","v":" Less Allowance to the extent exempt u/s10   "},null,null,null,null,null,null,null,{"$f":"INVEST!D28&\" + \"&INVEST!D29&\" + \"&INVEST!D30&\" + \"&INVEST!D31","v":" +  +  + "},null,null,null,null,{"$f":"INVEST!F28+INVEST!F29+INVEST!F30+INVEST!F31","v":0},null,{"$f":"IF(W2=2,0,P19)","v":0}]
[null,5,"Less Profession tax, Enterteainment Allow ( not eligible)",null,null,null,null,null,null,null,null,null,null,{"$f":"'det.sal input'!W31& \" +\"&'det.sal input'!W35","v":" +"},null,null,null,{"$f":"IF(W2=2,0,'det.sal input'!W31+'det.sal input'!W35)","v":0}]
[null,6,"Less Standard deduction ( maximum 50000)",null,null,null,null,null,null,null,null,null,null,null,null,null,null,{"$f":"IF((R18-R19-R20)>50000,50000,(R18-R19-R20))","v":0}]
[null,"6a","Net Salary Income [Income chargeble under the head salary]  (3-4-5-6)",null,null,null,null,null,null,null,null,null,null,null,null,null,":",{"$f":"R18-R19-R20-R21","v":0}]
[null,7,"1. Income from house property (HBA interest not eligible to deduct)",null,null,null,null,null,null,null,null,null,null,null,{"$f":"IF(INVEST!F17<0,INVEST!F17*-1,IF(W2=2,0,0-MIN(W23:X23)))","v":0},null,null,{"$f":"IF(ISNUMBER(#REF!),#REF!,\"Nil\")","v":"Nil"},null,null,null,null,200000,{"$f":"INVEST!F17","v":0},{"$f":"X23-W23","v":-200000}]
[null,null,"2.Other sources Income INCLUDING PAY REVISION ARREAR INTEREST  Interest on investment / Family pension (1/3 of family pension or 15000 whichever  is less is exempted)/ Post office SB interest get exemption up to 3500 [Sec. 10(15)(i)] applicable for New regime also",null,null,null,null,null,null,null,null,null,null,null,{"$f":"'arrear det'!K13+'tds det'!D30+'tds det'!F29+'tds det'!D26+'tds det'!E26+'tds det'!D33+'tds det'!E33+'tds det'!D34+'tds det'!E34+'det.sal input'!W30-Z24","v":0},null,null,{"$f":"\"Pay revision interest \"&'arrear det'!K13","v":"Pay revision interest 0"},{"$f":"\"Post off SB+ other SB \"&'tds det'!D30+'tds det'!F29","v":"Post off SB+ other SB 0"},{"$f":"\"Investment interest \"&'tds det'!D26+'tds det'!E26+'tds det'!D33+'tds det'!E33+'tds det'!D34+'tds det'!E34","v":"Investment interest 0"},null,{"$f":"\"Family Pension \"&AB24-Z24","v":"Family Pension 0"},"1/3 family pension",{"$f":"ROUND('det.sal input'!W30/3,0)","v":0},15000,{"$f":"MIN(X24:Y24)","v":0},"taxable portion of family pen",{"$f":"IF(W2=2,'det.sal input'!W30-'new statement for PRINT'!Z24+Z24,'det.sal input'!W30-'new statement for PRINT'!Z24)","v":0}]
[null,null,"3. Income from profession",null,null,null,null,null,null,null,null,null,null,null,{"$f":"'tds det'!F42","v":0}]
[null,null,"4.Captal gain income",null,null,null,null,null,null,null,null,null,null,null,{"$f":"'tds det'!F38","v":0},null,"Total",{"$f":"SUM(O23:P26)","v":0}]
[null,8,"Gross Total Income (6+7)",null,null,null,null,null,null,null,null,null,null,null,null,null,":",{"$f":"R22+R26","v":0}]
[null,9,"Deduction under chapter VI-A",null,null,null,null,null,null,null,null,null,null,null,"Amount spent",null,null,"Eligible amount"]
[null,null,"A - Deduction under section 80C"]
[null,null,"a) ","Providend fund contribution",null,null,null,null,null,null,null,null,null,":",{"$f":"M96","v":0}]
[null,null,"c)","State Life Insurance Policy (SLI)",null,null,null,null,null,null,null,null,null,":",{"$f":"N96","v":0}]
[null,null,"c) ","Group Insurance Scheme (GIS)",null,null,null,null,null,null,null,null,null,":",{"$f":"O96","v":0}]
[null,null,"d) ","Tax saving Fixed deposits (Available at all banks) /Sukanya samrudhi",null,null,null,null,null,null,null,null,null,":",{"$f":"INVEST!F8","v":0}]
[null,null,"e) ","Life Insurence  salary deduction",null,null,null,null,null,null,null,null,null,null,{"$f":"P96","v":0}]
[null,null,"f) ","Life Insurence other than salary deduction ",null,null,null,null,null,null,null,null,null,":",{"$f":"INVEST!F5","v":0}]
[null,null,"g) ",{"$f":"'det.sal input'!R6&\" +  \"&'det.sal input'!T6","v":"? +  ?"},null,null,null,null,null,null,null,null,null,null,{"$f":"R96","v":0}]
[null,null,"h) ","NSC VIII th issue (Nationional Savings certificate from post offices)",null,null,null,null,null,null,null,null,null,":",{"$f":"INVEST!F7","v":0}]
[null,null,"i)","Public Provident Fund (PPF) (Available at Post offfices)",null,null,null,null,null,null,null,null,null,":",{"$f":"INVEST!F9","v":0}]
[null,null,null,"ULIP/ Tax saving mutual funds",null,null,null,null,null,null,null,null,null,null,{"$f":"INVEST!F10","v":0},null,null,null,null,null,null,null,"nps allowed amt",null,null,null,null," NEW taxab inc","TAX new"]
[null,null,"j)","Tuition Fees ( Paid  for full time education to any two children -only the tuition fee portion-donations should be excluded)",null,null,null,null,null,null,null,null,null,":",{"$f":"INVEST!F11","v":0},null,null,null,null,null,null,null,{"$f":"O44","v":0},{"$f":"IF(O44=0,\"\",(O45-O44-150000)*-1)","v":""},null,null,null,{"$f":"R59","v":0},{"$f":"IF(AB40<300001,0,IF(AB40<600001,(AB40-300000)*5/100,IF(AB40<900001,(15000+(AB40-600000)*10/100),IF(AB40<1200001,(45000+(AB40-900000)*15/100),IF(AB40<1500001,90000+(AB40-1200000)*20/100,IF(AB40>1500000,150000+(AB40-1500000)*30/100))))))","v":0}]
[null,null,"k)","Housing Loan Repayment (PRINCIPAL PORTION ONLY) for construction loan only. Not for addition / repair loan etc.  Stamp duty paid for purchase of property can be included",null,null,null,null,null,null,null,null,null,":",{"$f":"INVEST!F12","v":0},null,null,null,null,null,null,null,"OVER 1.5",{"$f":"IF(O45<=150000,0,(O45)-150000)","v":0},"MAX 80CC-1B=",50000,"TOT NPS=",{"$f":"X46","v":0},"MIN AMT =",{"$f":"MIN(X41,Z41,AB41)","v":0}]
[null,null,"l)",{"$f":"INVEST!E13","v":0},null,null,null,null,null,null,null,null,null,null,{"$f":"INVEST!F13","v":0},null,null,null,null,null,null,null,"Tot VIA excl nps=",{"$f":"SUM(O30:P43)","v":0},"ALLOED VIA =",150000]
[null,null,"B- Contribution to Pension Fund (80CCC)",null,null,null,null,null,null,null,null,null,null,null,{"$f":"INVEST!F6","v":0}]
[null,null,"C-Contrubution to National Pension Scheme - NPS (80CCD)",null,null,null,null,null,null,null,null,null,null,":",{"$f":"X46","v":0},null,null,{"$f":"MIN(W40:X40)","v":0},null,null,null,null,"nps sal ded",{"$f":"'det.sal input'!U26","v":0}]
[null,null,"D- Total investment under  Sec.  80C, 80CCC, 80CCD, eligible amt. limited to 1.5  lakh",null,null,null,null,null,null,null,null,null,null,null,{"$f":"SUM(O30:P44)","v":0},null,null,{"$f":"IF(W2=2,0,IF(O45<=150000,O45,150000))","v":0},null,null,null,null,"nps direct pay",{"$f":"INVEST!F15","v":0}]
[null,10,"a. ","Contrubution to National Pension Scheme - NPS Section 80CCD(1B) Investment upto 50000 can be made additionally",null,null,null,null,null,null,null,null,null,":",{"$f":"AD41","v":0},null,null,null,null,null,null,null,"total NPS",{"$f":"X44+X45","v":0}]
[null,null,"b.","Employer's contribution to NPS [Up to 10% Pay+Da+AGPgets excemption u/s Section 80CCD(2)]",null,null,null,null,null,null,null,null,null,null,{"$f":"IF(Z47<X47,Z47,X47)","v":0},null,null,null,null,null,null,null,"total pay+da+agp 10% =",{"$f":"ROUND(AA47*0.1,0)","v":0},"Empr contri =",{"$f":"'det.sal input'!W32","v":0},{"$f":"'det.sal input'!C26+'det.sal input'!D26+'det.sal input'!F26-'det.sal input'!C20","v":0}]
[null,null,"c.","Investment in Rajiv Gandhi Equity Savings Scheme 80CCG (50% of investment gets exemption.Maximum 25000)"]
[null,null,"c) ","Mediclaim ( Maximum of Rs.25,000 for self, spouse, children and Rs.25000 for Parents. if Parents are senior citizens Rs.50,000)(80 D)",null,null,null,null,null,null,null,null,null,":",{"$f":"Z49","v":0},null,null,null,null,null,null,null,"max 80 D=",55000,"Actual 80d =",{"$f":"INVEST!F18","v":0}]
[null,null,"d) ","Expenditure on Medical treatment of mentally or physically handicapped dependents (including Specified investments there on). ( Max. Rs.75,000/- in case of severe disability max. Rs.1,25,000) (80DD)",null,null,null,null,null,null,null,null,null,":",{"$f":"IF(Z50<X50,Z50,X50)","v":0},null,null,null,null,null,null,null,"max 80dd=",125000,"Actual 80dd =",{"$f":"INVEST!F21","v":0}]
[null,null,"e) ","For medical treatment of specified diseases of self/dependent . Actual exp. Or Rs. 40000/60000/ 80000 which ever is less gets excemption depending on age. Should submit Form-10-I. (80 DDB)",null,null,null,null,null,null,null,null,null,null,{"$f":"INVEST!F22","v":0}]
[null,null,"f)","Any amount of interest paid for Educational Loan  for higher education of the employee's dependent children [u/s 80E]",null,null,null,null,null,null,null,null,null,":",{"$f":"INVEST!F20","v":0}]
[null,null,"g) ","Additional deduction on housing loan interest (maximum 50000) if the following conditions are satisfied. 1. loan amount is not above Rs. 35 lakhs,  2.  Loan sanctioned in 2016-17,  3. He is a first time home buyer,   4.  cost of house does not exceed Rs. 50 lakhs (80EE)",null,null,null,null,null,null,null,null,null,null,{"$f":"IF(W53<0,0,W53)","v":0},null,null,null,null,null,null,null,{"$f":"IF(PERSONAL!H20=\"YES\",'new statement for PRINT'!X23-'new statement for PRINT'!W23,0)","v":0}]
[null,null,"h) ",{"$f":"'new statement'!D54:M54","v":"Electric vehicle loan interest repayment (up to 1.5 Lakh) (80EEB)"},null,null,null,null,null,null,null,null,null,null,{"$f":"'new statement'!O54:P54","v":0}]
[null,null,"i)"," Donation to special funds only  PM's National Relief Fund,  Earth quake fund Etc (80G)",null,null,null,null,null,null,null,null,null,":",{"$f":"INVEST!F19+S96","v":0}]
[null,null,"j)","Dedution for differently abled Employees( 80U)For blindness,Hearing impaired, Mental retradation, Mental illness, low vision, Locomotors disability.  Fixed deduction of 75000 (For disability not less than 40%)  / 1.25 Lakh, for severe disability over 80% ",null,null,null,null,null,null,null,null,null,":",{"$f":"INVEST!F23","v":0}]
[null,null,null,"Total of 10",null,null,null,null,null,null,null,null,null,null,{"$f":"SUM(O46:P56)","v":0}]
[null,11,"Total Deduction   (9+10)",null,null,null,null,null,null,null,null,null,null,null,null,null,null,{"$f":"IF(W2=2,O47,R45+O57)","v":0}]
[null,12,"Total Income or Taxable Income  (rounded off to the nearest multiple of ten (8-11)",null,null,null,null,null,null,null,null,null,null,null,"Before rounding",null,{"$f":"R27-R58","v":0},{"$f":"IF(R27-R58>0,ROUND(((R27-R58)/10),0)*10,0)","v":0}]
[null,13,"Tax on Total Income (New rate option) First 3 Lakh, Nil, next 3 Lakh 5%, next 3 Lakh 10%, next 3 Lakh 15%,  next 3 Lakh 20%,  Remaining income 30%",null,null,null,null,null,null,null,null,null,null,null,null,null,":",{"$f":"IF(W2=2,AC40,'new form 16'!J81)","v":0}]
[null,14,"Less 87 A Rebate, upto maximum of Rs.25000, available  if Taxable income is less than 700001 (Rebate u/s 87A) Marginal relief under Sec115 BAC (1A) is applicable if taxable income is above 7 Lakhs",null,null,null,null,null,null,null,null,null,null,null,null,null,null,{"$f":"taxplanning!S290","v":0},null,null,{"$f":"IF('new statement (2)'!R61='new statement for PRINT'!R61,\"\",\"Sec115 BAC (1A) Marginal relief applicable\")","v":""}]
[null,15,"Balance of Tax after 87A rebate ",null,null,null,null,null,null,null,null,null,null,null,null,null,null,{"$f":"R60-R61","v":0}]
[null,16,"Education Cess @ 4% of  tax",null,null,null,null,null,null,null,null,null,null,null,null,null,":",{"$f":"ROUND(R62*0.04,0)","v":0}]
[null,17,"Total Tax Payable (13-14+16)",null,null,null,null,null,null,null,null,null,null,null,null,null,":",{"$f":"R62+R63","v":0},null,null,null,null,{"$f":"R64","v":0}]
[null,18,"Less : Relief for Arrears of Salary u/s 89(1) attach 10 E set of forms and previous years tax statements",null,null,null,null,null,null,null,null,null,null,null,null,null,":",{"$f":"'ARR MONH SPLIT'!I107","v":0},null,null,null,{"$f":"IF('Form 10E NEW REG'!B2=\"\",\"\",\"ERROR\")","v":""},{"$f":"IF(INVEST!F24>R64,R64,'Form 10E'!H40)","v":0}]
[null,19,"Balance Tax Payable (17-18) rounded to 10 rupees.",null,null,null,null,null,null,null,null,{"$f":"\"( before rounding \"&ROUND(R64-R65,0)&\") \"","v":"( before rounding 0) "},null,null,null,null,":",{"$f":"ROUND((R64-R65),-1)","v":0}]
[null,20,"Amount of Tax already deducted from salary (TDS)",null,null,null,null,null,null,null,null,null,null,null,null,null,":",{"$f":"'det.sal input'!Q26","v":0}]
[null,21,"Amount of Tax deducted from interest on deposits (FD,RD etc ), Capital Gain, Profession Income",null,null,null,null,null,null,null,null,null,null,null,null,null,null,{"$f":"'tds det'!I37","v":0},null,null,null,null,{"$f":"R66-R68-R69","v":0},{"$f":"ROUND(W68,-1)","v":0}]
[null,22,"Advance tax/ other TDS paid (Challan pay) details :",null,null,null,null,null,null,null,null,null,null,{"$f":"'tds det'!D18&\", \"&'tds det'!E47","v":"0, "},null,null,null,{"$f":"'tds det'!I38","v":0}]
[null,23,{"$f":"IF(R70>=0,\"Balance of Tax  to be deducted now (19-20-21-22) \",\"Excess TDS payment made, can apply for refund during e-filing\")","v":"Balance of Tax  to be deducted now (19-20-21-22) "},null,null,null,null,null,null,null,null,null,null,{"$f":"\"Before rounding \"&R64-R65-R67-R68-R69","v":"Before rounding 0"},null,null,null,{"$f":"ROUND((R66-R67-R68-R69),0)","v":0},null,null,null,null,{"$f":"ROUND(R70,-1)","v":0}]
[null,24,{"$f":"\"Monthly TDS amount  required in the next  \"&PERSONAL!H21&\" month(s)\"","v":"Monthly TDS amount  required in the next  3 month(s)"},null,null,null,null,null,null,null,null,null,null,null,null,null,null,null,null,{"$f":"IF(R70<1,0,R70/PERSONAL!H21)","v":0}]
[null,{"$f":"FACE!D1&\" version\"","v":"2023 December 21 version"}]
[null,{"$f":"\"True copy, Counter signed by \"&CUSTOMISE!H24&\", \"&CUSTOMISE!H26","v":"True copy, Counter signed by , "},null,null,null,null,null,null,null,null,null,null,null,null,null,null,null,null,null,null,null,{"$f":"PERSONAL!H4&\", \"&PERSONAL!H6","v":", "},"10 ലേക്ക് ROUND  ചെയ്ത നികുതി സംഖ്യയാണ് ശരിയായ നികുതി. "]
[null,{"$f":"\"Place: \"&PERSONAL!H11","v":"Place: 0"},null,null,null,null,null,null,null,null,null,null,null,null,"http://babuvadukkumchery.blogspot.com",null,null,null,null,null,null,null,"ROUND  ചെയ്യാത്ത തുക ഇവിടെ വെറുതെ  അറിവിലേക്കായി നല്‍കീ എന്നേ കരുതേണ്ടൂ "]
[null,"Date :",null,{"$f":"TEXT(TODAY(),\"dd/mm/yyyy\")","v":"05/02/2024"}]
[null,{"$f":"IF(print!P9=\"ANTICIPATORY TAX CALCULATOR\",\"DETAILS OF EXPECTED SALARY AND DEDUCTIONS  FOR THE FINANCIAL YEAR 2023-24\",\"DETAILS OF  SALARY AND DEDUCTIONS  FOR THE FINANCIAL YEAR 2023-24\")","v":"DETAILS OF EXPECTED SALARY AND DEDUCTIONS  FOR THE FINANCIAL YEAR 2023-24"}]
[null,null,null,{"$f":"IF('det.sal input'!$B$6=\"pension\",\"PENSION RECEIPTS\",\"SALARY RECEIPTS\")","v":"SALARY RECEIPTS"},null,null,null,null,null,null,null,null,"DEDUCTIONS FROM OFFICE"]
[null," For the Month",null,"Pay /Pension","AGP","DA","HRA",{"$f":"UPPER('det.sal input'!H6)","v":"?"},{"$f":"UPPER('det.sal input'!I6)","v":"?"},{"$f":"UPPER('det.sal input'!J6)","v":"?"},{"$f":"UPPER('det.sal input'!K6)","v":"?"},"Total",{"$f":"'det.sal input'!M6","v":"PF"},{"$f":"'det.sal input'!N6","v":"SLI"},{"$f":"'det.sal input'!O6","v":"GI"},"LIC/PLI","TDS",{"$f":"UPPER('det.sal input'!R6&\"+ \"&'det.sal input'!T6)","v":"?+ ?"},{"$f":"'new statement'!S78","v":"Donation - Office deduction only 80 G"},{"$f":"'det.sal input'!U6","v":" (NPS)"},{"$f":"'new statement'!U78","v":"MEDISEP (S-80 D)"},{"$f":"'det.sal input'!W6","v":"TOTAL DEDUCTIONS"}]
[null,{"$f":"IF('det.sal input'!$B$6=\"pension\",\"April-23\",\"March-23\")","v":"March-23"},null,{"$f":"'det.sal input'!C8","v":0},{"$f":"'det.sal input'!D8","v":0},{"$f":"'det.sal input'!F8","v":0},{"$f":"'det.sal input'!G8","v":0},{"$f":"'det.sal input'!H8","v":0},{"$f":"'det.sal input'!I8","v":0},{"$f":"'det.sal input'!J8","v":0},{"$f":"'det.sal input'!K8","v":0},{"$f":"'det.sal input'!L8","v":0},{"$f":"'det.sal input'!M8","v":0},{"$f":"'det.sal input'!N8","v":0},{"$f":"'det.sal input'!O8","v":0},{"$f":"'det.sal input'!P8","v":0},{"$f":"'det.sal input'!Q8","v":0},{"$f":"'det.sal input'!R8+'det.sal input'!T8","v":0},{"$f":"'det.sal input'!S8","v":0},{"$f":"'det.sal input'!U8","v":0},{"$f":"'new statement'!U79","v":0},{"$f":"'det.sal input'!W8","v":0}]
[null,{"$f":"IF('det.sal input'!$B$6=\"pension\",\"May\",\"April\")","v":"April"},null,{"$f":"'det.sal input'!C9","v":0},{"$f":"'det.sal input'!D9","v":0},{"$f":"'det.sal input'!F9","v":0},{"$f":"'det.sal input'!G9","v":0},{"$f":"'det.sal input'!H9","v":0},{"$f":"'det.sal input'!I9","v":0},{"$f":"'det.sal input'!J9","v":0},{"$f":"'det.sal input'!K9","v":0},{"$f":"'det.sal input'!L9","v":0},{"$f":"'det.sal input'!M9","v":0},{"$f":"'det.sal input'!N9","v":0},{"$f":"'det.sal input'!O9","v":0},{"$f":"'det.sal input'!P9","v":0},{"$f":"'det.sal input'!Q9","v":0},{"$f":"'det.sal input'!R9+'det.sal input'!T9","v":0},{"$f":"'det.sal input'!S9","v":0},{"$f":"'det.sal input'!U9","v":0},{"$f":"'new statement'!U80","v":0},{"$f":"'det.sal input'!W9","v":0}]
[null,{"$f":"'det.sal input'!B10","v":"May"},null,{"$f":"'det.sal input'!C10","v":0},{"$f":"'det.sal input'!D10","v":0},{"$f":"'det.sal input'!F10","v":0},{"$f":"'det.sal input'!G10","v":0},{"$f":"'det.sal input'!H10","v":0},{"$f":"'det.sal input'!I10","v":0},{"$f":"'det.sal input'!J10","v":0},{"$f":"'det.sal input'!K10","v":0},{"$f":"'det.sal input'!L10","v":0},{"$f":"'det.sal input'!M10","v":0},{"$f":"'det.sal input'!N10","v":0},{"$f":"'det.sal input'!O10","v":0},{"$f":"'det.sal input'!P10","v":0},{"$f":"'det.sal input'!Q10","v":0},{"$f":"'det.sal input'!R10+'det.sal input'!T10","v":0},{"$f":"'det.sal input'!S10","v":0},{"$f":"'det.sal input'!U10","v":0},{"$f":"'new statement'!U81","v":0},{"$f":"'det.sal input'!W10","v":0}]
[null,{"$f":"'det.sal input'!B11","v":"June"},null,{"$f":"'det.sal input'!C11","v":0},{"$f":"'det.sal input'!D11","v":0},{"$f":"'det.sal input'!F11","v":0},{"$f":"'det.sal input'!G11","v":0},{"$f":"'det.sal input'!H11","v":0},{"$f":"'det.sal input'!I11","v":0},{"$f":"'det.sal input'!J11","v":0},{"$f":"'det.sal input'!K11","v":0},{"$f":"'det.sal input'!L11","v":0},{"$f":"'det.sal input'!M11","v":0},{"$f":"'det.sal input'!N11","v":0},{"$f":"'det.sal input'!O11","v":0},{"$f":"'det.sal input'!P11","v":0},{"$f":"'det.sal input'!Q11","v":0},{"$f":"'det.sal input'!R11+'det.sal input'!T11","v":0},{"$f":"'det.sal input'!S11","v":0},{"$f":"'det.sal input'!U11","v":0},{"$f":"'new statement'!U82","v":0},{"$f":"'det.sal input'!W11","v":0}]
[null,{"$f":"'det.sal input'!B12","v":"July"},null,{"$f":"'det.sal input'!C12","v":0},{"$f":"'det.sal input'!D12","v":0},{"$f":"'det.sal input'!F12","v":0},{"$f":"'det.sal input'!G12","v":0},{"$f":"'det.sal input'!H12","v":0},{"$f":"'det.sal input'!I12","v":0},{"$f":"'det.sal input'!J12","v":0},{"$f":"'det.sal input'!K12","v":0},{"$f":"'det.sal input'!L12","v":0},{"$f":"'det.sal input'!M12","v":0},{"$f":"'det.sal input'!N12","v":0},{"$f":"'det.sal input'!O12","v":0},{"$f":"'det.sal input'!P12","v":0},{"$f":"'det.sal input'!Q12","v":0},{"$f":"'det.sal input'!R12+'det.sal input'!T12","v":0},{"$f":"'det.sal input'!S12","v":0},{"$f":"'det.sal input'!U12","v":0},{"$f":"'new statement'!U83","v":0},{"$f":"'det.sal input'!W12","v":0}]
[null,{"$f":"'det.sal input'!B13","v":"August"},null,{"$f":"'det.sal input'!C13","v":0},{"$f":"'det.sal input'!D13","v":0},{"$f":"'det.sal input'!F13","v":0},{"$f":"'det.sal input'!G13","v":0},{"$f":"'det.sal input'!H13","v":0},{"$f":"'det.sal input'!I13","v":0},{"$f":"'det.sal input'!J13","v":0},{"$f":"'det.sal input'!K13","v":0},{"$f":"'det.sal input'!L13","v":0},{"$f":"'det.sal input'!M13","v":0},{"$f":"'det.sal input'!N13","v":0},{"$f":"'det.sal input'!O13","v":0},{"$f":"'det.sal input'!P13","v":0},{"$f":"'det.sal input'!Q13","v":0},{"$f":"'det.sal input'!R13+'det.sal input'!T13","v":0},{"$f":"'det.sal input'!S13","v":0},{"$f":"'det.sal input'!U13","v":0},{"$f":"'new statement'!U84","v":0},{"$f":"'det.sal input'!W13","v":0}]
[null,{"$f":"'det.sal input'!B14","v":"September"},null,{"$f":"'det.sal input'!C14","v":0},{"$f":"'det.sal input'!D14","v":0},{"$f":"'det.sal input'!F14","v":0},{"$f":"'det.sal input'!G14","v":0},{"$f":"'det.sal input'!H14","v":0},{"$f":"'det.sal input'!I14","v":0},{"$f":"'det.sal input'!J14","v":0},{"$f":"'det.sal input'!K14","v":0},{"$f":"'det.sal input'!L14","v":0},{"$f":"'det.sal input'!M14","v":0},{"$f":"'det.sal input'!N14","v":0},{"$f":"'det.sal input'!O14","v":0},{"$f":"'det.sal input'!P14","v":0},{"$f":"'det.sal input'!Q14","v":0},{"$f":"'det.sal input'!R14+'det.sal input'!T14","v":0},{"$f":"'det.sal input'!S14","v":0},{"$f":"'det.sal input'!U14","v":0},{"$f":"'new statement'!U85","v":0},{"$f":"'det.sal input'!W14","v":0}]
[{"$f":"FACE!D1","v":"2023 December 21"},{"$f":"'det.sal input'!B15","v":"October"},null,{"$f":"'det.sal input'!C15","v":0},{"$f":"'det.sal input'!D15","v":0},{"$f":"'det.sal input'!F15","v":0},{"$f":"'det.sal input'!G15","v":0},{"$f":"'det.sal input'!H15","v":0},{"$f":"'det.sal input'!I15","v":0},{"$f":"'det.sal input'!J15","v":0},{"$f":"'det.sal input'!K15","v":0},{"$f":"'det.sal input'!L15","v":0},{"$f":"'det.sal input'!M15","v":0},{"$f":"'det.sal input'!N15","v":0},{"$f":"'det.sal input'!O15","v":0},{"$f":"'det.sal input'!P15","v":0},{"$f":"'det.sal input'!Q15","v":0},{"$f":"'det.sal input'!R15+'det.sal input'!T15","v":0},{"$f":"'det.sal input'!S15","v":0},{"$f":"'det.sal input'!U15","v":0},{"$f":"'new statement'!U86","v":0},{"$f":"'det.sal input'!W15","v":0}]
[null,{"$f":"'det.sal input'!B16","v":"November"},null,{"$f":"'det.sal input'!C16","v":0},{"$f":"'det.sal input'!D16","v":0},{"$f":"'det.sal input'!F16","v":0},{"$f":"'det.sal input'!G16","v":0},{"$f":"'det.sal input'!H16","v":0},{"$f":"'det.sal input'!I16","v":0},{"$f":"'det.sal input'!J16","v":0},{"$f":"'det.sal input'!K16","v":0},{"$f":"'det.sal input'!L16","v":0},{"$f":"'det.sal input'!M16","v":0},{"$f":"'det.sal input'!N16","v":0},{"$f":"'det.sal input'!O16","v":0},{"$f":"'det.sal input'!P16","v":0},{"$f":"'det.sal input'!Q16","v":0},{"$f":"'det.sal input'!R16+'det.sal input'!T16","v":0},{"$f":"'det.sal input'!S16","v":0},{"$f":"'det.sal input'!U16","v":0},{"$f":"'new statement'!U87","v":0},{"$f":"'det.sal input'!W16","v":0}]
[null,{"$f":"'det.sal input'!B17","v":"December"},null,{"$f":"'det.sal input'!C17","v":0},{"$f":"'det.sal input'!D17","v":0},{"$f":"'det.sal input'!F17","v":0},{"$f":"'det.sal input'!G17","v":0},{"$f":"'det.sal input'!H17","v":0},{"$f":"'det.sal input'!I17","v":0},{"$f":"'det.sal input'!J17","v":0},{"$f":"'det.sal input'!K17","v":0},{"$f":"'det.sal input'!L17","v":0},{"$f":"'det.sal input'!M17","v":0},{"$f":"'det.sal input'!N17","v":0},{"$f":"'det.sal input'!O17","v":0},{"$f":"'det.sal input'!P17","v":0},{"$f":"'det.sal input'!Q17","v":0},{"$f":"'det.sal input'!R17+'det.sal input'!T17","v":0},{"$f":"'det.sal input'!S17","v":0},{"$f":"'det.sal input'!U17","v":0},{"$f":"'new statement'!U88","v":0},{"$f":"'det.sal input'!W17","v":0}]
[null,{"$f":"'det.sal input'!B18","v":"Jan- 2024"},null,{"$f":"'det.sal input'!C18","v":0},{"$f":"'det.sal input'!D18","v":0},{"$f":"'det.sal input'!F18","v":0},{"$f":"'det.sal input'!G18","v":0},{"$f":"'det.sal input'!H18","v":0},{"$f":"'det.sal input'!I18","v":0},{"$f":"'det.sal input'!J18","v":0},{"$f":"'det.sal input'!K18","v":0},{"$f":"'det.sal input'!L18","v":0},{"$f":"'det.sal input'!M18","v":0},{"$f":"'det.sal input'!N18","v":0},{"$f":"'det.sal input'!O18","v":0},{"$f":"'det.sal input'!P18","v":0},{"$f":"'det.sal input'!Q18","v":0},{"$f":"'det.sal input'!R18+'det.sal input'!T18","v":0},{"$f":"'det.sal input'!S18","v":0},{"$f":"'det.sal input'!U18","v":0},{"$f":"'new statement'!U89","v":0},{"$f":"'det.sal input'!W18","v":0}]
[null,{"$f":"'det.sal input'!B19","v":"Feb-2024"},null,{"$f":"'det.sal input'!C19","v":0},{"$f":"'det.sal input'!D19","v":0},{"$f":"'det.sal input'!F19","v":0},{"$f":"'det.sal input'!G19","v":0},{"$f":"'det.sal input'!H19","v":0},{"$f":"'det.sal input'!I19","v":0},{"$f":"'det.sal input'!J19","v":0},{"$f":"'det.sal input'!K19","v":0},{"$f":"'det.sal input'!L19","v":0},{"$f":"'det.sal input'!M19","v":0},{"$f":"'det.sal input'!N19","v":0},{"$f":"'det.sal input'!O19","v":0},{"$f":"'det.sal input'!P19","v":0},{"$f":"'det.sal input'!Q19+R70","v":0},{"$f":"'det.sal input'!R19+'det.sal input'!T19","v":0},{"$f":"'det.sal input'!S19","v":0},{"$f":"'det.sal input'!U19","v":0},{"$f":"'new statement'!U90","v":0},{"$f":"'det.sal input'!W19","v":0}]
[null,"Fest. All",null,{"$f":"'det.sal input'!C20","v":0},null,null,null,null,null,null,null,{"$f":"'det.sal input'!L20","v":0},null,null,null,null,null,null,{"$f":"'det.sal input'!S20","v":0}]
[null,"Arrear","PF",{"$f":"'det.sal input'!C21","v":0},{"$f":"'det.sal input'!D21","v":0},{"$f":"'det.sal input'!F21","v":0},{"$f":"'det.sal input'!G21","v":0},{"$f":"'det.sal input'!H21","v":0},{"$f":"'det.sal input'!I21","v":0},{"$f":"'det.sal input'!J21","v":0},{"$f":"'det.sal input'!K21","v":0},{"$f":"'det.sal input'!L21","v":0},{"$f":"'det.sal input'!M21","v":0},{"$f":"'det.sal input'!N21","v":0},{"$f":"'det.sal input'!O21","v":0},{"$f":"'det.sal input'!P21","v":0},{"$f":"'det.sal input'!Q21","v":0},{"$f":"'det.sal input'!R21+'det.sal input'!T21","v":0},{"$f":"'det.sal input'!S21","v":0},{"$f":"'det.sal input'!U21","v":0},null,{"$f":"'det.sal input'!W21","v":0}]
[null,null,"CASH/NPS",{"$f":"'det.sal input'!C22","v":0},{"$f":"'det.sal input'!D22","v":0},{"$f":"'det.sal input'!F22","v":0},{"$f":"'det.sal input'!G22","v":0},{"$f":"'det.sal input'!H22","v":0},{"$f":"'det.sal input'!I22","v":0},{"$f":"'det.sal input'!J22","v":0},{"$f":"'det.sal input'!K22","v":0},{"$f":"'det.sal input'!L22","v":0},{"$f":"'det.sal input'!M22","v":0},{"$f":"'det.sal input'!N22","v":0},{"$f":"'det.sal input'!O22","v":0},{"$f":"'det.sal input'!P22","v":0},{"$f":"'det.sal input'!Q22","v":0},{"$f":"'det.sal input'!R22+'det.sal input'!T22","v":0},{"$f":"'det.sal input'!S22","v":0},{"$f":"'det.sal input'!U22","v":0},null,{"$f":"'det.sal input'!W22","v":0}]
[null,"Leave surrender",null,{"$f":"'det.sal input'!C23","v":0},{"$f":"'det.sal input'!D23","v":0},{"$f":"'det.sal input'!F23","v":0},{"$f":"'det.sal input'!G23","v":0},{"$f":"'det.sal input'!H23","v":0},{"$f":"'det.sal input'!I23","v":0},{"$f":"'det.sal input'!J23","v":0},{"$f":"'det.sal input'!K23","v":0},{"$f":"'det.sal input'!L23","v":0},{"$f":"'det.sal input'!M23","v":0},{"$f":"'det.sal input'!N23","v":0},{"$f":"'det.sal input'!O23","v":0},{"$f":"'det.sal input'!P23","v":0},{"$f":"'det.sal input'!Q23","v":0},{"$f":"'det.sal input'!R23+'det.sal input'!T23","v":0},{"$f":"'det.sal input'!S23","v":0},{"$f":"'det.sal input'!U23","v":0},null,{"$f":"'det.sal input'!W23","v":0}]
[null,"Deferred Salary Arrear",null,{"$f":"'det.sal input'!C25","v":0},{"$f":"'det.sal input'!D24","v":0},{"$f":"'det.sal input'!F24","v":0},{"$f":"'det.sal input'!G24","v":0},{"$f":"'det.sal input'!H24","v":0},{"$f":"'det.sal input'!I24","v":0},{"$f":"'det.sal input'!J24","v":0},{"$f":"'det.sal input'!K24","v":0},{"$f":"'det.sal input'!L25","v":0},{"$f":"'det.sal input'!M24","v":0},{"$f":"'det.sal input'!N24","v":0},{"$f":"'det.sal input'!O24","v":0},{"$f":"'det.sal input'!P24","v":0},{"$f":"'det.sal input'!Q24","v":0},{"$f":"'det.sal input'!R24+'det.sal input'!T24","v":0},{"$f":"'det.sal input'!S24","v":0},{"$f":"'det.sal input'!U24","v":0},null,{"$f":"'det.sal input'!W24","v":0}]
[null,"Total *",null,{"$f":"'det.sal input'!C26","v":0},{"$f":"'det.sal input'!D26","v":0},{"$f":"'det.sal input'!F26","v":0},{"$f":"'det.sal input'!G26","v":0},{"$f":"'det.sal input'!H26","v":0},{"$f":"'det.sal input'!I26","v":0},{"$f":"'det.sal input'!J26","v":0},{"$f":"'det.sal input'!K26","v":0},{"$f":"'det.sal input'!L26","v":0},{"$f":"'det.sal input'!M26","v":0},{"$f":"'det.sal input'!N26","v":0},{"$f":"'det.sal input'!O26","v":0},{"$f":"'det.sal input'!P26","v":0},{"$f":"SUM(Q79:Q89)+SUM(Q91:Q95)+Q90","v":0},{"$f":"'det.sal input'!R26+'det.sal input'!T26","v":0},{"$f":"'det.sal input'!S26","v":0},{"$f":"'det.sal input'!U26","v":0},{"$f":"SUM(U79:U95)","v":0},{"$f":"SUM(V79:V95)","v":0}]
[null,{"$f":"IF('det.sal input'!C24=\"\",\"\",\"* Total includes other office receipts or refunds\")","v":""}]
[null,null,null,{"$f":"IF(#REF!<0,\"Refund of salary\",\"Other receipts from office\")","v":{"$error":"#REF!"}},null,null,null,null,null,null,null,null,null,null,null,null,null,{"$f":"ROUND(W69,-1)","v":0}]
[]
[]
[]
[]
[]
[]
[]
[]
[]
[]
[]
[]
[]
[]
[]
[]
[]
[]
[]
[]
[]
[]
[]
[]
[]
[]
[]
[]
[]
[]
[]
[]
[]
[]
[]
[]
[]
[]
[]
[]
[]
[]
[]
[]
[]
[]
[]
[]
[]
[]
[]
[]
[]
[]
[]
[]
[]
[]
[]
[]
[]
[]
[]
[]
[]
[]
[]
[]
[]
[]
[]
[]
[]
[]
[]
[]
[]
[]
[]
[]
[]
[]
[]
[]
[]
[]
[]
[]
[]
[]
[]
[]
[]
[]
[]
[]
[]
[]
[]
[]
[]
[]
[]
[]
[]
[]
[]
[]
[]
[]
[]
[]
[]
[]
[]
[]
[]
[]
[]
[]
[]
[]
[]
[null,null,null,null,null,null,null,null,null,null,null,null,null,null,null,null,null,null,null,null,null,null,null,null,null,null,null,null,null,null,"Male",{"$f":"IF(AND(R59>200000,R59<=500000),(R59-200000)*0.1,IF(AND(R59>500000,R59<=1000000),30000+(R59-500000)*0.2,IF(R59>1000000,130000+(R59-1000000)*0.3,\"Nil\")))","v":"Nil"}]
[null,null,null,null,null,null,null,null,null,null,null,null,null,null,null,null,null,null,null,null,null,null,null,null,null,null,null,null,null,null,"Female",{"$f":"IF(AND(R59>200000,R59<=500000),(R59-200000)*0.1,IF(AND(R59>500000,R59<=1000000),30000+(R59-500000)*0.2,IF(R59>1000000,130000+(R59-1000000)*0.3,\"Nil\")))","v":"Nil"}]
[null,null,null,null,null,null,null,null,null,null,null,null,null,null,null,null,null,null,null,null,null,null,null,null,null,null,null,null,null,null,"Senior",{"$f":"IF(AND(R59>250000,R59<=500000),(R59-250000)*0.1,IF(AND(R59>500000,R59<=1000000),25000+(R59-500000)*0.2,IF(R59>1000000,125000+(R59-1000000)*0.3,\"Nil\")))","v":"Nil"}]
[null,null,null,null,null,null,null,null,null,null,null,null,null,null,null,null,null,null,null,null,null,null,null,null,null,null,null,null,null,null,"Senior2",{"$f":"IF(AND(R59>500000,R59<=1000000),(R59-500000)*0.2,IF(R59>1000000,100000+(R59-1000000)*0.3,\"Nil\"))","v":"Nil"}]
[]
[]
[]
[null,null,null,null,null,null,null,null,null,null,null,null,null,null,null,null,null,null,null,null,null,null,null,null,null,null,null,null,null,null,{"$f":"IF(O30<>\"Nil\",\"Life Insurance Premum\",\"\")","v":"Life Insurance Premum"},{"$f":"IF(O30<>\"Nil\",O30,\"\")","v":0},{"$f":"IF(ROW()-ROW(two)+1>ROWS(one)-COUNTBLANK(one),\"\",INDIRECT(ADDRESS(SMALL((IF(one<>\"\",ROW(one),ROW()+ROWS(one))),ROW()-ROW(two)+1),COLUMN(one),4)))","v":{"$error":"#REF!"}},{"$f":"IF(AG229<>\"\",VLOOKUP(AG229,AE229:AF242,2,FALSE),\"\")","v":{"$error":"#REF!"}}]
[null,null,null,null,null,null,null,null,null,null,null,null,null,null,null,null,null,null,null,null,null,null,null,null,null,null,null,null,null,null,{"$f":"IF(#REF!<>\"Nil\",\"Purchase of NSC\",\"\")","v":{"$error":"#REF!"}},{"$f":"IF(#REF!<>\"Nil\",#REF!,\"\")","v":{"$error":"#REF!"}},{"$f":"IF(ROW()-ROW(two)+1>ROWS(one)-COUNTBLANK(one),\"\",INDIRECT(ADDRESS(SMALL((IF(one<>\"\",ROW(one),ROW()+ROWS(one))),ROW()-ROW(two)+1),COLUMN(one),4)))","v":{"$error":"#REF!"}},{"$f":"IF(AG230<>\"\",VLOOKUP(AG230,AE230:AF245,2,FALSE),\"\")","v":{"$error":"#REF!"}}]
[null,null,null,null,null,null,null,null,null,null,null,null,null,null,null,null,null,null,null,null,null,null,null,null,null,null,null,null,null,null,{"$f":"IF(O32<>\"Nil\",\"State Life Insurance (SLI)\",\"\")","v":"State Life Insurance (SLI)"},{"$f":"IF(O32<>\"Nil\",O32,\"\")","v":0},{"$f":"IF(ROW()-ROW(two)+1>ROWS(one)-COUNTBLANK(one),\"\",INDIRECT(ADDRESS(SMALL((IF(one<>\"\",ROW(one),ROW()+ROWS(one))),ROW()-ROW(two)+1),COLUMN(one),4)))","v":{"$error":"#REF!"}},{"$f":"IF(AG231<>\"\",VLOOKUP(AG231,AE231:AF246,2,FALSE),\"\")","v":{"$error":"#REF!"}}]
[null,null,null,null,null,null,null,null,null,null,null,null,null,null,null,null,null,null,null,null,null,null,null,null,null,null,null,null,null,null,{"$f":"IF(O33<>\"Nil\",\"Group Insurance Scheme (GIS)\",\"\")","v":"Group Insurance Scheme (GIS)"},{"$f":"IF(O33<>\"Nil\",O33,\"\")","v":0},{"$f":"IF(ROW()-ROW(two)+1>ROWS(one)-COUNTBLANK(one),\"\",INDIRECT(ADDRESS(SMALL((IF(one<>\"\",ROW(one),ROW()+ROWS(one))),ROW()-ROW(two)+1),COLUMN(one),4)))","v":{"$error":"#REF!"}},{"$f":"IF(AG232<>\"\",VLOOKUP(AG232,AE232:AF247,2,FALSE),\"\")","v":{"$error":"#REF!"}}]
[null,null,null,null,null,null,null,null,null,null,null,null,null,null,null,null,null,null,null,null,null,null,null,null,null,null,null,null,null,null,{"$f":"IF(#REF!<>\"Nil\",\"Group Personal Accident Insurance (GPAIS)\",\"\")","v":{"$error":"#REF!"}},{"$f":"IF(#REF!<>\"Nil\",#REF!,\"\")","v":{"$error":"#REF!"}},{"$f":"IF(ROW()-ROW(two)+1>ROWS(one)-COUNTBLANK(one),\"\",INDIRECT(ADDRESS(SMALL((IF(one<>\"\",ROW(one),ROW()+ROWS(one))),ROW()-ROW(two)+1),COLUMN(one),4)))","v":{"$error":"#REF!"}},{"$f":"IF(AG233<>\"\",VLOOKUP(AG233,AE233:AF248,2,FALSE),\"\")","v":{"$error":"#REF!"}}]
[null,null,null,null,null,null,null,null,null,null,null,null,null,null,null,null,null,null,null,null,null,null,null,null,null,null,null,null,null,null,{"$f":"IF(O34<>\"Nil\",D34,\"\")","v":"Life Insurence  salary deduction"},{"$f":"IF(O34<>\"Nil\",O34,\"\")","v":0},{"$f":"IF(ROW()-ROW(two)+1>ROWS(one)-COUNTBLANK(one),\"\",INDIRECT(ADDRESS(SMALL((IF(one<>\"\",ROW(one),ROW()+ROWS(one))),ROW()-ROW(two)+1),COLUMN(one),4)))","v":{"$error":"#REF!"}},{"$f":"IF(AG234<>\"\",VLOOKUP(AG234,AE234:AF249,2,FALSE),\"\")","v":{"$error":"#REF!"}}]
[null,null,null,null,null,null,null,null,null,null,null,null,null,null,null,null,null,null,null,null,null,null,null,null,null,null,null,null,null,null,{"$f":"IF(O35<>\"Nil\",\"Provident Fund\",\"\")","v":"Provident Fund"},{"$f":"IF(O35<>\"Nil\",O35,\"\")","v":0},{"$f":"IF(ROW()-ROW(two)+1>ROWS(one)-COUNTBLANK(one),\"\",INDIRECT(ADDRESS(SMALL((IF(one<>\"\",ROW(one),ROW()+ROWS(one))),ROW()-ROW(two)+1),COLUMN(one),4)))","v":{"$error":"#REF!"}},{"$f":"IF(AG235<>\"\",VLOOKUP(AG235,AE235:AF249,2,FALSE),\"\")","v":{"$error":"#REF!"}}]
[null,null,null,null,null,null,null,null,null,null,null,null,null,null,null,null,null,null,null,null,null,null,null,null,null,null,null,null,null,null,{"$f":"IF(O38<>\"Nil\",\"Unit Linked Insurance\",\"\")","v":"Unit Linked Insurance"},{"$f":"IF(O38<>\"Nil\",O38,\"\")","v":0},{"$f":"IF(ROW()-ROW(two)+1>ROWS(one)-COUNTBLANK(one),\"\",INDIRECT(ADDRESS(SMALL((IF(one<>\"\",ROW(one),ROW()+ROWS(one))),ROW()-ROW(two)+1),COLUMN(one),4)))","v":{"$error":"#REF!"}},{"$f":"IF(AG236<>\"\",VLOOKUP(AG236,AE236:AF250,2,FALSE),\"\")","v":{"$error":"#REF!"}}]
[null,null,null,null,null,null,null,null,null,null,null,null,null,null,null,null,null,null,null,null,null,null,null,null,null,null,null,null,null,null,{"$f":"IF(#REF!<>\"Nil\",\"Tax Saving Mutual Fund\",\"\")","v":{"$error":"#REF!"}},{"$f":"IF(#REF!<>\"Nil\",#REF!,\"\")","v":{"$error":"#REF!"}},{"$f":"IF(ROW()-ROW(two)+1>ROWS(one)-COUNTBLANK(one),\"\",INDIRECT(ADDRESS(SMALL((IF(one<>\"\",ROW(one),ROW()+ROWS(one))),ROW()-ROW(two)+1),COLUMN(one),4)))","v":{"$error":"#REF!"}},{"$f":"IF(AG237<>\"\",VLOOKUP(AG237,AE237:AF251,2,FALSE),\"\")","v":{"$error":"#REF!"}}]
[null,null,null,null,null,null,null,null,null,null,null,null,null,null,null,null,null,null,null,null,null,null,null,null,null,null,null,null,null,null,{"$f":"IF(O40<>\"Nil\",\"Tuition Fees\",\"\")","v":"Tuition Fees"},{"$f":"IF(O40<>\"Nil\",O40,\"\")","v":0},{"$f":"IF(ROW()-ROW(two)+1>ROWS(one)-COUNTBLANK(one),\"\",INDIRECT(ADDRESS(SMALL((IF(one<>\"\",ROW(one),ROW()+ROWS(one))),ROW()-ROW(two)+1),COLUMN(one),4)))","v":{"$error":"#REF!"}},{"$f":"IF(AG238<>\"\",VLOOKUP(AG238,AE237:AF252,2,FALSE),\"\")","v":{"$error":"#REF!"}}]
[null,null,null,null,null,null,null,null,null,null,null,null,null,null,null,null,null,null,null,null,null,null,null,null,null,null,null,null,null,null,{"$f":"IF(O41<>\"Nil\",\"Housing Loan Repayment\",\"\")","v":"Housing Loan Repayment"},{"$f":"IF(O41<>\"Nil\",O41,\"\")","v":0},{"$f":"IF(ROW()-ROW(two)+1>ROWS(one)-COUNTBLANK(one),\"\",INDIRECT(ADDRESS(SMALL((IF(one<>\"\",ROW(one),ROW()+ROWS(one))),ROW()-ROW(two)+1),COLUMN(one),4)))","v":{"$error":"#REF!"}},{"$f":"IF(AG239<>\"\",VLOOKUP(AG239,AE238:AF252,2,FALSE),\"\")","v":{"$error":"#REF!"}}]
[null,null,null,null,null,null,null,null,null,null,null,null,null,null,null,null,null,null,null,null,null,null,null,null,null,null,null,null,null,null,{"$f":"IF(#REF!<>\"Nil\",\"Eligibleshares & debentures\",\"\")","v":{"$error":"#REF!"}},{"$f":"IF(#REF!<>\"Nil\",#REF!,\"\")","v":{"$error":"#REF!"}},{"$f":"IF(ROW()-ROW(two)+1>ROWS(one)-COUNTBLANK(one),\"\",INDIRECT(ADDRESS(SMALL((IF(one<>\"\",ROW(one),ROW()+ROWS(one))),ROW()-ROW(two)+1),COLUMN(one),4)))","v":{"$error":"#REF!"}},{"$f":"IF(AG240<>\"\",VLOOKUP(AG240,AE238:AF252,2,FALSE),\"\")","v":{"$error":"#REF!"}}]
[null,null,null,null,null,null,null,null,null,null,null,null,null,null,null,null,null,null,null,null,null,null,null,null,null,null,null,null,null,null,{"$f":"IF(#REF!<>\"Nil\",\"Mutual Fund\",\"\")","v":{"$error":"#REF!"}},{"$f":"IF(#REF!<>\"Nil\",#REF!,\"\")","v":{"$error":"#REF!"}},{"$f":"IF(ROW()-ROW(two)+1>ROWS(one)-COUNTBLANK(one),\"\",INDIRECT(ADDRESS(SMALL((IF(one<>\"\",ROW(one),ROW()+ROWS(one))),ROW()-ROW(two)+1),COLUMN(one),4)))","v":{"$error":"#REF!"}},{"$f":"IF(AG241<>\"\",VLOOKUP(AG241,AE239:AF252,2,FALSE),\"\")","v":{"$error":"#REF!"}}]
[null,null,null,null,null,null,null,null,null,null,null,null,null,null,null,null,null,null,null,null,null,null,null,null,null,null,null,null,null,null,{"$f":"IF(#REF!<>\"Nil\",#REF!,\"\")","v":{"$error":"#REF!"}},{"$f":"IF(#REF!<>\"Nil\",#REF!,\"\")","v":{"$error":"#REF!"}},{"$f":"IF(ROW()-ROW(two)+1>ROWS(one)-COUNTBLANK(one),\"\",INDIRECT(ADDRESS(SMALL((IF(one<>\"\",ROW(one),ROW()+ROWS(one))),ROW()-ROW(two)+1),COLUMN(one),4)))","v":{"$error":"#REF!"}},{"$f":"IF(AG242<>\"\",VLOOKUP(AG242,AE240:AF252,2,FALSE),\"\")","v":{"$error":"#REF!"}}]
[null,null,null,null,null,null,null,null,null,null,null,null,null,null,null,null,null,null,null,null,null,null,null,null,null,null,null,null,null,null,null,null,{"$f":"IF(ROW()-ROW(two)+1>ROWS(one)-COUNTBLANK(one),\"\",INDIRECT(ADDRESS(SMALL((IF(one<>\"\",ROW(one),ROW()+ROWS(one))),ROW()-ROW(two)+1),COLUMN(one),4)))","v":""},{"$f":"IF(AG243<>\"\",VLOOKUP(AG243,AE241:AF252,2,FALSE),\"\")","v":""}]
[null,null,null,null,null,null,null,null,null,null,null,null,null,null,null,null,null,null,null,null,null,null,null,null,null,null,null,null,null,null,null,null,{"$f":"IF(ROW()-ROW(two)+1>ROWS(one)-COUNTBLANK(one),\"\",INDIRECT(ADDRESS(SMALL((IF(one<>\"\",ROW(one),ROW()+ROWS(one))),ROW()-ROW(two)+1),COLUMN(one),4)))","v":""},{"$f":"IF(AG244<>\"\",VLOOKUP(AG244,AE242:AF253,2,FALSE),\"\")","v":""}]
[]
[]
[null,null,null,null,null,null,null,null,null,null,null,null,null,null,null,null,null,null,null,null,null,null,null,null,null,null,null,null,null,null,{"$f":"IF('new statement for PRINT'!O49<>\"Nil\",\"Mediclaim Policies (Sec 80D)\",\"\")","v":"Mediclaim Policies (Sec 80D)"},{"$f":"IF(AE247<>\"\",O49,\"\")","v":0},{"$f":"IF(ROW()-ROW(four)+1>ROWS(three)-COUNTBLANK(three),\"\",INDIRECT(ADDRESS(SMALL((IF(three<>\"\",ROW(three),ROW()+ROWS(three))),ROW()-ROW(four)+1),COLUMN(three),4)))","v":{"$error":"#REF!"}},{"$f":"IF(ROW()-ROW(fouramt)+1>ROWS(threeamt)-COUNTBLANK(threeamt),\"\",INDIRECT(ADDRESS(SMALL((IF(threeamt<>\"\",ROW(threeamt),ROW()+ROWS(threeamt))),ROW()-ROW(fouramt)+1),COLUMN(threeamt),4)))","v":{"$error":"#REF!"}}]
[null,null,null,null,null,null,null,null,null,null,null,null,null,null,null,null,null,null,null,null,null,null,null,null,null,null,null,null,null,null,{"$f":"IF('new statement for PRINT'!O50<>\"Nil\",\"Medical Treatment Mentally or Physically handicapped (Sec-80DD)\",\"\")","v":"Medical Treatment Mentally or Physically handicapped (Sec-80DD)"},{"$f":"IF(AE248<>\"\",O50,\"\")","v":0},{"$f":"IF(ROW()-ROW(four)+1>ROWS(three)-COUNTBLANK(three),\"\",INDIRECT(ADDRESS(SMALL((IF(three<>\"\",ROW(three),ROW()+ROWS(three))),ROW()-ROW(four)+1),COLUMN(three),4)))","v":{"$error":"#REF!"}},{"$f":"IF(ROW()-ROW(fouramt)+1>ROWS(threeamt)-COUNTBLANK(threeamt),\"\",INDIRECT(ADDRESS(SMALL((IF(threeamt<>\"\",ROW(threeamt),ROW()+ROWS(threeamt))),ROW()-ROW(fouramt)+1),COLUMN(threeamt),4)))","v":{"$error":"#REF!"}}]
[null,null,null,null,null,null,null,null,null,null,null,null,null,null,null,null,null,null,null,null,null,null,null,null,null,null,null,null,null,null,{"$f":"IF('new statement for PRINT'!#REF!<>\"Nil\",\"Expenditure on Medical Treatment(Sec-80DDB)\",\"\")","v":{"$error":"#REF!"}},{"$f":"IF(AE249<>\"\",#REF!,\"\")","v":{"$error":"#REF!"}},{"$f":"IF(ROW()-ROW(four)+1>ROWS(three)-COUNTBLANK(three),\"\",INDIRECT(ADDRESS(SMALL((IF(three<>\"\",ROW(three),ROW()+ROWS(three))),ROW()-ROW(four)+1),COLUMN(three),4)))","v":{"$error":"#REF!"}},{"$f":"IF(ROW()-ROW(fouramt)+1>ROWS(threeamt)-COUNTBLANK(threeamt),\"\",INDIRECT(ADDRESS(SMALL((IF(threeamt<>\"\",ROW(threeamt),ROW()+ROWS(threeamt))),ROW()-ROW(fouramt)+1),COLUMN(threeamt),4)))","v":{"$error":"#REF!"}}]
[null,null,null,null,null,null,null,null,null,null,null,null,null,null,null,null,null,null,null,null,null,null,null,null,null,null,null,null,null,null,{"$f":"IF('new statement for PRINT'!O52<>\"Nil\",\"Interest on Educational Loan (Sec-80 E)\",\"\")","v":"Interest on Educational Loan (Sec-80 E)"},{"$f":"IF(AE250<>\"\",O52,\"\")","v":0},{"$f":"IF(ROW()-ROW(four)+1>ROWS(three)-COUNTBLANK(three),\"\",INDIRECT(ADDRESS(SMALL((IF(three<>\"\",ROW(three),ROW()+ROWS(three))),ROW()-ROW(four)+1),COLUMN(three),4)))","v":{"$error":"#REF!"}},{"$f":"IF(ROW()-ROW(fouramt)+1>ROWS(threeamt)-COUNTBLANK(threeamt),\"\",INDIRECT(ADDRESS(SMALL((IF(threeamt<>\"\",ROW(threeamt),ROW()+ROWS(threeamt))),ROW()-ROW(fouramt)+1),COLUMN(threeamt),4)))","v":{"$error":"#REF!"}}]
[null,null,null,null,null,null,null,null,null,null,null,null,null,null,null,null,null,null,null,null,null,null,null,null,null,null,null,null,null,null,{"$f":"IF('new statement for PRINT'!O55<>\"Nil\",\"Donation to Charitable Institutions (Sec-80 G)\",\"\")","v":"Donation to Charitable Institutions (Sec-80 G)"},{"$f":"IF(AE251<>\"\",O55,\"\")","v":0},{"$f":"IF(ROW()-ROW(four)+1>ROWS(three)-COUNTBLANK(three),\"\",INDIRECT(ADDRESS(SMALL((IF(three<>\"\",ROW(three),ROW()+ROWS(three))),ROW()-ROW(four)+1),COLUMN(three),4)))","v":{"$error":"#REF!"}},{"$f":"IF(ROW()-ROW(fouramt)+1>ROWS(threeamt)-COUNTBLANK(threeamt),\"\",INDIRECT(ADDRESS(SMALL((IF(threeamt<>\"\",ROW(threeamt),ROW()+ROWS(threeamt))),ROW()-ROW(fouramt)+1),COLUMN(threeamt),4)))","v":{"$error":"#REF!"}}]
[null,null,null,null,null,null,null,null,null,null,null,null,null,null,null,null,null,null,null,null,null,null,null,null,null,null,null,null,null,null,{"$f":"IF('new statement for PRINT'!#REF!<>\"Nil\",\"Contribution to Political Parties (Sec-80 GGC)\",\"\")","v":{"$error":"#REF!"}},{"$f":"IF(AE252<>\"\",#REF!,\"\")","v":{"$error":"#REF!"}},{"$f":"IF(ROW()-ROW(four)+1>ROWS(three)-COUNTBLANK(three),\"\",INDIRECT(ADDRESS(SMALL((IF(three<>\"\",ROW(three),ROW()+ROWS(three))),ROW()-ROW(four)+1),COLUMN(three),4)))","v":{"$error":"#REF!"}},{"$f":"IF(ROW()-ROW(fouramt)+1>ROWS(threeamt)-COUNTBLANK(threeamt),\"\",INDIRECT(ADDRESS(SMALL((IF(threeamt<>\"\",ROW(threeamt),ROW()+ROWS(threeamt))),ROW()-ROW(fouramt)+1),COLUMN(threeamt),4)))","v":{"$error":"#REF!"}}]
[null,null,null,null,null,null,null,null,null,null,null,null,null,null,null,null,null,null,null,null,null,null,null,null,null,null,null,null,null,null,{"$f":"IF('new statement for PRINT'!O56<>\"Nil\",\"Deduction for Handicapped Employees (u/s 80U)\",\"\")","v":"Deduction for Handicapped Employees (u/s 80U)"},{"$f":"IF(AE253<>\"\",O56,\"\")","v":0},{"$f":"IF(ROW()-ROW(four)+1>ROWS(three)-COUNTBLANK(three),\"\",INDIRECT(ADDRESS(SMALL((IF(three<>\"\",ROW(three),ROW()+ROWS(three))),ROW()-ROW(four)+1),COLUMN(three),4)))","v":{"$error":"#REF!"}},{"$f":"IF(ROW()-ROW(fouramt)+1>ROWS(threeamt)-COUNTBLANK(threeamt),\"\",INDIRECT(ADDRESS(SMALL((IF(threeamt<>\"\",ROW(threeamt),ROW()+ROWS(threeamt))),ROW()-ROW(fouramt)+1),COLUMN(threeamt),4)))","v":{"$error":"#REF!"}}]
[]
[null,null,null,null,null,null,null,null,null,null,null,null,null,null,null,null,null,null,null,null,null,null,null,null,null,null,null,null,null,null,{"$f":"IF(ISNUMBER(#REF!),\"Income From House Property\",\"\")","v":""},{"$f":"IF(AE255<>\"\",#REF!,\"\")","v":""},{"$f":"IF(ROW()-ROW(six)+1>ROWS(five)-COUNTBLANK(five),\"\",INDIRECT(ADDRESS(SMALL((IF(five<>\"\",ROW(five),ROW()+ROWS(five))),ROW()-ROW(six)+1),COLUMN(five),4)))","v":{"$error":"#REF!"}},{"$f":"IF(ROW()-ROW(sixamt)+1>ROWS(fiveamt)-COUNTBLANK(fiveamt),\"\",INDIRECT(ADDRESS(SMALL((IF(fiveamt<>\"\",ROW(fiveamt),ROW()+ROWS(fiveamt))),ROW()-ROW(sixamt)+1),COLUMN(fiveamt),4)))","v":{"$error":"#REF!"}}]
[null,null,null,null,null,null,null,null,null,null,null,null,null,null,null,null,null,null,null,null,null,null,null,null,null,null,null,null,null,null,{"$f":"IF(#REF!>0,#REF!,\"\")","v":{"$error":"#REF!"}},{"$f":"IF(AE256<>\"\",#REF!,\"\")","v":{"$error":"#REF!"}},{"$f":"IF(ROW()-ROW(six)+1>ROWS(five)-COUNTBLANK(five),\"\",INDIRECT(ADDRESS(SMALL((IF(five<>\"\",ROW(five),ROW()+ROWS(five))),ROW()-ROW(six)+1),COLUMN(five),4)))","v":{"$error":"#REF!"}},{"$f":"IF(ROW()-ROW(sixamt)+1>ROWS(fiveamt)-COUNTBLANK(fiveamt),\"\",INDIRECT(ADDRESS(SMALL((IF(fiveamt<>\"\",ROW(fiveamt),ROW()+ROWS(fiveamt))),ROW()-ROW(sixamt)+1),COLUMN(fiveamt),4)))","v":{"$error":"#REF!"}}]
[null,null,null,null,null,null,null,null,null,null,null,null,null,null,null,null,null,null,null,null,null,null,null,null,null,null,null,null,null,null,{"$f":"IF(#REF!>0,#REF!,\"\")","v":{"$error":"#REF!"}},{"$f":"IF(AE257<>\"\",#REF!,\"\")","v":{"$error":"#REF!"}},{"$f":"IF(ROW()-ROW(six)+1>ROWS(five)-COUNTBLANK(five),\"\",INDIRECT(ADDRESS(SMALL((IF(five<>\"\",ROW(five),ROW()+ROWS(five))),ROW()-ROW(six)+1),COLUMN(five),4)))","v":{"$error":"#REF!"}},{"$f":"IF(ROW()-ROW(sixamt)+1>ROWS(fiveamt)-COUNTBLANK(fiveamt),\"\",INDIRECT(ADDRESS(SMALL((IF(fiveamt<>\"\",ROW(fiveamt),ROW()+ROWS(fiveamt))),ROW()-ROW(sixamt)+1),COLUMN(fiveamt),4)))","v":{"$error":"#REF!"}}]
[null,null,null,null,null,null,null,null,null,null,null,null,null,null,null,null,null,null,null,null,null,null,null,null,null,null,null,null,null,null,{"$f":"IF(#REF!>0,#REF!,\"\")","v":{"$error":"#REF!"}},{"$f":"IF(AE258<>\"\",#REF!,\"\")","v":{"$error":"#REF!"}},{"$f":"IF(ROW()-ROW(six)+1>ROWS(five)-COUNTBLANK(five),\"\",INDIRECT(ADDRESS(SMALL((IF(five<>\"\",ROW(five),ROW()+ROWS(five))),ROW()-ROW(six)+1),COLUMN(five),4)))","v":""},{"$f":"IF(ROW()-ROW(sixamt)+1>ROWS(fiveamt)-COUNTBLANK(fiveamt),\"\",INDIRECT(ADDRESS(SMALL((IF(fiveamt<>\"\",ROW(fiveamt),ROW()+ROWS(fiveamt))),ROW()-ROW(sixamt)+1),COLUMN(fiveamt),4)))","v":""}]
[]
[]
[null,null,null,null,null,null,null,null,null,null,null,null,null,null,null,null,null,null,null,null,null,null,null,null,null,null,null,null,null,null,{"$f":"IF(AND(R66<>\"Nil\",R67<>\"Nil\"),R66-R67,IF(AND(R66>0,R67=\"Nil\"),R66,IF(AND(R67>0,R66=\"Nil\"),(0-R67),\"Nil\")))","v":0}]

{"sheet":"new statement (2)","index":21,"n_rows":261,"n_cols":34,"rows_kept":261,"cut":false,"hidden":false,"merged":[[6,17,6,19],[7,3,7,15],[7,17,7,19],[8,3,8,15],[8,17,8,19],[11,3,11,15],[11,17,11,19],[0,22,0,25],[2,1,2,21],[3,1,3,19],[4,1,4,3],[4,5,4,13],[4,14,4,15],[4,16,4,19],[4,22,6,25],[5,17,5,21],[0,15,0,16],[0,3,0,14],[1,1,1,16],[1,17,1,21],[12,1,16,1],[13,3,13,12],[13,14,13,15],[14,3,14,11],[14,14,14,15],[15,3,15,12],[15,14,15,15],[5,5,5,8],[6,1,11,1],[6,3,6,15],[19,2,19,12],[19,17,19,19],[20,2,20,12],[20,17,20,19],[21,2,21,15],[21,17,21,19],[15,17,15,19],[16,2,16,13],[16,17,16,19],[17,2,17,12],[17,17,17,19],[18,10,18,14],[18,17,18,19],[25,14,25,15],[25,17,25,19],[26,2,26,15],[26,17,26,19],[27,2,27,12],[27,14,27,16],[27,17,27,21],[22,2,22,13],[22,14,22,15],[22,17,22,19],[23,2,23,13],[23,14,23,15],[24,14,24,15],[31,24,31,27],[32,3,32,12],[32,14,32,15],[32,17,32,19],[32,24,32,27],[33,3,33,12],[33,14,33,15],[28,1,34,1],[28,17,28,21],[29,3,29,12],[29,14,29,15],[29,17,29,19],[29,24,29,27],[30,14,30,15],[31,3,31,12],[31,14,31,15],[31,17,31,19],[36,3,36,12],[36,14,36,15],[37,3,37,12],[37,14,37,15],[37,24,37,27],[38,3,38,12],[38,14,38,15],[34,3,34,12],[34,14,34,15],[34,17,34,19],[34,24,34,27],[35,3,35,13],[35,14,35,15],[42,2,42,12],[42,14,42,15],[42,17,42,19],[43,2,43,12],[43,14,43,15],[43,17,43,19],[39,3,39,12],[39,14,39,15],[40,3,40,12],[40,14,40,15],[40,17,40,19],[41,3,41,13],[41,14,41,15],[46,3,46,12],[46,14,46,15],[47,3,47,12],[47,14,47,15],[48,3,48,12],[48,14,48,15],[43,24,43,27],[44,2,44,13],[44,14,44,15],[44,17,44,19],[45,3,45,12],[45,14,45,15],[45,17,45,19],[51,3,51,12],[51,14,51,15],[51,17,51,19],[52,3,52,12],[52,14,52,15],[54,3,54,12],[54,14,54,15],[54,17,54,19],[48,17,48,19],[49,3,49,12],[49,14,49,15],[49,17,49,19],[50,3,50,13],[50,14,50,15],[53,3,53,12],[53,14,53,15],[58,17,58,19],[59,2,59,15],[59,17,59,19],[60,2,60,16],[60,17,60,19],[61,2,61,16],[61,17,61,19],[55,3,55,12],[55,14,55,15],[55,17,55,19],[56,14,56,15],[56,17,56,19],[57,2,57,16],[57,17,57,19],[65,2,65,10],[65,17,65,19],[66,2,66,12],[66,17,66,19],[67,2,67,16],[67,17,67,19],[62,2,62,12],[62,17,62,19],[63,2,63,12],[63,17,63,19],[64,2,64,15],[64,17,64,19],[71,15,71,21],[73,14,73,21],[74,6,74,15],[75,1,75,21],[76,3,76,11],[76,12,76,21],[68,2,68,12],[68,13,68,16],[68,17,68,19],[69,2,69,12],[69,13,69,16],[69,17,69,19],[85,0,95,0],[85,1,85,2],[85,24,85,30],[86,1,86,2],[86,24,86,29],[87,1,87,2],[77,1,77,2],[78,1,78,2],[79,1,79,2],[80,1,80,2],[81,1,81,2],[82,1,82,2],[95,1,95,2],[88,1,88,2],[89,1,89,2],[90,1,90,2],[91,1,92,1],[93,1,93,2],[94,1,94,2],[83,1,83,2],[83,24,83,29],[84,1,84,2],[84,24,84,28]]}
[{"$f":"F5&\" \"& B2","v":"0 ANTICIPATORY INCOME TAX STATEMENT(NEW RATE OPTION)-FINANCIAL YEAR 2023-24 (AY 24-25) "},{"$f":"INVEST!K3","v":0},{"$f":"INVEST!L3","v":0},{"$f":"IF(C1>B1,\"Warning ! Your are in the wrong field. The New Regime option is not suitable for you.  To choose  the economical option, click the green button on the right side\",\"\")","v":""},null,null,null,null,null,null,null,null,null,null,null,{"$f":"IF(D1=\"\",0,1)","v":0}]
[null,{"$f":"IF(print!P9=\"ANTICIPATORY TAX CALCULATOR\",\"ANTICIPATORY INCOME TAX STATEMENT(NEW RATE OPTION)-FINANCIAL YEAR 2023-24 (AY 24-25) \",\"INCOME TAX STATEMENT(NEW RATE OPTION)-FINANCIAL YEAR 2023-24 (AY 24-25)\")","v":"ANTICIPATORY INCOME TAX STATEMENT(NEW RATE OPTION)-FINANCIAL YEAR 2023-24 (AY 24-25) "},null,null,null,null,null,null,null,null,null,null,null,null,null,null,null,{"$f":"CUSTOMISE!H22","v":0},null,null,null,null,2]
[null,{"$f":"PERSONAL!H10","v":"SALARY"},null,null,null,null,null,null,null,null,null,null,null,null,null,null,null,null,null,null,null,null,2]
[]
[null,"Name",null,null,null,{"$f":"PERSONAL!H4","v":0},null,null,null,null,null,null,null,null,"PAN :",null,{"$f":"PERSONAL!H7","v":0},null,null,null,null,null,{"$f":"IF(PERSONAL!H8=\"no\",\"\",IF('det.sal input'!AC39>'det.sal input'!AB38,\"You cannot claim for benifit of living in a rental home [HRA benifit], because rent paid amount is less than 10% of your salary\",\"\"))","v":""}]
[null,"Designation     ",null,null,null,{"$f":"PERSONAL!H6","v":0},null,null,null,null,null,{"$f":"PERSONAL!H5","v":"Below 60 Years"},null,null,null,null,null,"NEW REGIME RATE"]
[null,1,"a","Gross Salary (Excluding interest on arrear salary),  Festival allowance, Bonus,Leave Surrender)(includes Salary, DA, HRA, CCA, Interim Relief, , DA Arrear, Pay Revision Arrear  etc)",null,null,null,null,null,null,null,null,null,null,null,null,":",{"$f":"L96-L91-L94-'arrear det'!K13","v":0},null,null,null,null,null,null,null,null,{"$f":"'det.sal input'!AF29","v":1}]
[null,null,"b","Leave Surrender",null,null,null,null,null,null,null,null,null,null,null,null,":",{"$f":"L94","v":0},null,null,null,null,"medical reimb actual",{"$f":"'det.sal input'!W28","v":0},15000,"excess=",{"$f":"IF(AA7=1,0,IF((X8-Y8)>0,(X8-Y8),0))","v":0}]
[null,null,"c","Festival Allowance / Bonus / Ex-gratia and incentive",null,null,null,null,null,null,null,null,null,null,null,null,":",{"$f":"L91","v":0},null,null,null,null,{"$f":"SUM(R7:T9)","v":0}]
[null,null,"d","Value of perquisites (Iincludes Employer's contribution to NPS, Medical reimb. Taxable portion)",null,null,null,null,null,null,null,null,null,null,null,null,":",null,null,{"$f":"'det.sal input'!W32+'det.sal input'!W33+X8","v":0},null,null,null,null,null,null,"IF((V8-W8)>0,(V8-W8),0))"]
[null,null,"e","Profits in lieu of salary (S17-3)",null,null,null,null,null,null,null,null,null,null,null,null,":",null,null,{"$f":"'det.sal input'!W34","v":0},null,null,null,{"$f":"PERSONAL!H8","v":"NO"}]
[null,null,"f ","Total Salary Income (a+b+c+d+e)",null,null,null,null,null,null,null,null,null,null,null,null,":",{"$f":"SUM(R7:T11)","v":0}]
[null,2,"Deduction towards rent paid ",null,null,null,null,"Not available in New Regime option"]
[null,null,"i)","Actual HRA Received relating to the period",null,null,":",null,null,null,null,null,null,":",{"$f":"IF(X11=\"NO\",\"\",'det.sal input'!AB40)","v":""}]
[null,null,"ii)","Actual Rent paid in excess 1/10th of the salary",null,null,null,null,null,null,null,null,{"$f":"IF(O15=0,\"NIL\",\"\")","v":""},":",{"$f":"IF(X11=\"NO\",\"\",IF(Y15>AA15,Y15-AA15,0))","v":""},null,null,null,null,null,null,null,null,null,{"$f":"'det.sal input'!AB38","v":0},"1/10 of sal=",{"$f":"'det.sal input'!AC39","v":0},{"$f":"IF(Y15>AA15,Y15-AA15,0)","v":0}]
[null,null,"iii)","40% Salary ( For this salary means Basic + DA)",null,null,":",null,null,null,null,null,null,":",{"$f":"IF(X11=\"NO\",\"\",AA16)","v":""},null,null,{"$f":"IF(W2=2,0,(IF(R17=0,\"NIL\",R17)))","v":0},null,null,null,null,null,null,null,"40%sal =",{"$f":"ROUND(('det.sal input'!AB39*0.4),0)","v":0}]
[null,null,{"$f":"IF(PERSONAL!H8=\"no\",\"\",\" (Here, Salary means Basic+DA+AGP only, but include arrear/ surrender values relating to this period.) That is \"&'det.sal input'!R40&\"+\"&'det.sal input'!T40&\"+\"&'det.sal input'!W40&\"\")","v":""},null,null,null,null,null,null,null,null,null,null,null,null,null,":",{"$f":"IF(W2=2,0,MIN(O14:P16))","v":0}]
[null,3,"Balance ( 1- 2)",null,null,null,null,null,null,null,null,null,null,null,null,null,":",{"$f":"R12-R17","v":0}]
[null,4,{"$f":"\" Less Allowance to the extent exempt u/s10   \"","v":" Less Allowance to the extent exempt u/s10   "},null,null,null,null,null,null,null,{"$f":"INVEST!D28&\" + \"&INVEST!D29&\" + \"&INVEST!D30&\" + \"&INVEST!D31","v":" +  +  + "},null,null,null,null,{"$f":"INVEST!F28+INVEST!F29+INVEST!F30+INVEST!F31","v":0},null,{"$f":"IF(W2=2,0,P19)","v":0}]
[null,5,"Less Profession tax, Enterteainment Allow ( not eligible)",null,null,null,null,null,null,null,null,null,null,{"$f":"'det.sal input'!W31& \" +\"&'det.sal input'!W35","v":" +"},null,null,null,{"$f":"IF(W2=2,0,'det.sal input'!W31+'det.sal input'!W35)","v":0}]
[null,6,"Less Standard deduction ( maximum 50000)",null,null,null,null,null,null,null,null,null,null,null,null,null,null,{"$f":"IF((R18-R19-R20)>50000,50000,(R18-R19-R20))","v":0}]
[null,"6a","Net Salary Income [Income chargeble under the head salary]  (3-4-5-6)",null,null,null,null,null,null,null,null,null,null,null,null,null,":",{"$f":"R18-R19-R20-R21","v":0}]
[null,7,"1. Income from house property (HBA interest not eligible to deduct)",null,null,null,null,null,null,null,null,null,null,null,{"$f":"IF(INVEST!F17<0,INVEST!F17*-1,IF(W2=2,0,0-MIN(W23:X23)))","v":0},null,null,{"$f":"IF(ISNUMBER(#REF!),#REF!,\"Nil\")","v":"Nil"},null,null,null,null,200000,{"$f":"INVEST!F17","v":0},{"$f":"X23-W23","v":-200000}]
[null,null,"2.Other sources Income INCLUDING PAY REVISION ARREAR INTEREST  Interest on investment / Family pension (1/3 of family pension or 15000 whichever  is less is exempted)/ Post office SB interest get exemption up to 3500 [Sec. 10(15)(i)] applicable for New regime also",null,null,null,null,null,null,null,null,null,null,null,{"$f":"'arrear det'!K13+'tds det'!D30+'tds det'!F29+'tds det'!D26+'tds det'!E26+'tds det'!D33+'tds det'!E33+'tds det'!D34+'tds det'!E34+'det.sal input'!W30-Z24","v":0},null,null,{"$f":"\"Pay revision interest \"&'arrear det'!K13","v":"Pay revision interest 0"},{"$f":"\"Post off SB+ other SB \"&'tds det'!D30+'tds det'!F29","v":"Post off SB+ other SB 0"},{"$f":"\"Investment interest \"&'tds det'!D26+'tds det'!E26+'tds det'!D33+'tds det'!E33+'tds det'!D34+'tds det'!E34","v":"Investment interest 0"},null,{"$f":"\"Family Pension \"&AB24-Z24","v":"Family Pension 0"},"1/3 family pension",{"$f":"ROUND('det.sal input'!W30/3,0)","v":0},15000,{"$f":"MIN(X24:Y24)","v":0},"taxable portion of family pen",{"$f":"IF(W2=2,'det.sal input'!W30-'new statement (2)'!Z24+Z24,'det.sal input'!W30-'new statement (2)'!Z24)","v":0}]
[null,null,"3. Income from profession",null,null,null,null,null,null,null,null,null,null,null,{"$f":"'tds det'!F42","v":0}]
[null,null,"4.Captal gain income",null,null,null,null,null,null,null,null,null,null,null,{"$f":"'tds det'!F38","v":0},null,"Total",{"$f":"SUM(O23:P26)","v":0}]
[null,8,"Gross Total Income (6+7)",null,null,null,null,null,null,null,null,null,null,null,null,null,":",{"$f":"R22+R26","v":0}]
[null,9,"Deduction under chapter VI-A",null,null,null,null,null,null,null,null,null,null,null,"Amount spent",null,null,"Eligible amount"]
[null,null,"A - Deduction under section 80C"]
[null,null,"a) ","Providend fund contribution",null,null,null,null,null,null,null,null,null,":",{"$f":"M96","v":0}]
[null,null,"c)","State Life Insurance Policy (SLI)",null,null,null,null,null,null,null,null,null,":",{"$f":"N96","v":0}]
[null,null,"c) ","Group Insurance Scheme (GIS)",null,null,null,null,null,null,null,null,null,":",{"$f":"O96","v":0}]
[null,null,"d) ","Tax saving Fixed deposits (Available at all banks) /Sukanya samrudhi",null,null,null,null,null,null,null,null,null,":",{"$f":"INVEST!F8","v":0}]
[null,null,"e) ","Life Insurence  salary deduction",null,null,null,null,null,null,null,null,null,null,{"$f":"P96","v":0}]
[null,null,"f) ","Life Insurence other than salary deduction ",null,null,null,null,null,null,null,null,null,":",{"$f":"INVEST!F5","v":0}]
[null,null,"g) ",{"$f":"'det.sal input'!R6&\" +  \"&'det.sal input'!T6","v":"? +  ?"},null,null,null,null,null,null,null,null,null,null,{"$f":"R96","v":0}]
[null,null,"h) ","NSC VIII th issue (Nationional Savings certificate from post offices)",null,null,null,null,null,null,null,null,null,":",{"$f":"INVEST!F7","v":0}]
[null,null,"i)","Public Provident Fund (PPF) (Available at Post offfices)",null,null,null,null,null,null,null,null,null,":",{"$f":"INVEST!F9","v":0}]
[null,null,null,"ULIP/ Tax saving mutual funds",null,null,null,null,null,null,null,null,null,null,{"$f":"INVEST!F10","v":0},null,null,null,null,null,null,null,"nps allowed amt",null,null,null,null," NEW taxab inc","TAX new"]
[null,null,"j)","Tuition Fees ( Paid  for full time education to any two children -only the tuition fee portion-donations should be excluded)",null,null,null,null,null,null,null,null,null,":",{"$f":"INVEST!F11","v":0},null,null,null,null,null,null,null,{"$f":"O44","v":0},{"$f":"IF(O44=0,\"\",(O45-O44-150000)*-1)","v":""},null,null,null,{"$f":"R59","v":0},{"$f":"IF(AB40<300001,0,IF(AB40<600001,(AB40-300000)*5/100,IF(AB40<900001,(15000+(AB40-600000)*10/100),IF(AB40<1200001,(45000+(AB40-900000)*15/100),IF(AB40<1500001,90000+(AB40-1200000)*20/100,IF(AB40>1500000,150000+(AB40-1500000)*30/100))))))","v":0}]
[null,null,"k)","Housing Loan Repayment (PRINCIPAL PORTION ONLY) for construction loan only. Not for addition / repair loan etc.  Stamp duty paid for purchase of property can be included",null,null,null,null,null,null,null,null,null,":",{"$f":"INVEST!F12","v":0},null,null,null,null,null,null,null,"OVER 1.5",{"$f":"IF(O45<=150000,0,(O45)-150000)","v":0},"MAX 80CC-1B=",50000,"TOT NPS=",{"$f":"X46","v":0},"MIN AMT =",{"$f":"MIN(X41,Z41,AB41)","v":0}]
[null,null,"l)",{"$f":"INVEST!E13","v":0},null,null,null,null,null,null,null,null,null,null,{"$f":"INVEST!F13","v":0},null,null,null,null,null,null,null,"Tot VIA excl nps=",{"$f":"SUM(O30:P43)","v":0},"ALLOED VIA =",150000]
[null,null,"B- Contribution to Pension Fund (80CCC)",null,null,null,null,null,null,null,null,null,null,null,{"$f":"INVEST!F6","v":0}]
[null,null,"C-Contrubution to National Pension Scheme - NPS (80CCD)",null,null,null,null,null,null,null,null,null,null,":",{"$f":"X46","v":0},null,null,{"$f":"MIN(W40:X40)","v":0},null,null,null,null,"nps sal ded",{"$f":"'det.sal input'!U26","v":0}]
[null,null,"D- Total investment under  Sec.  80C, 80CCC, 80CCD, eligible amt. limited to 1.5  lakh",null,null,null,null,null,null,null,null,null,null,null,{"$f":"SUM(O30:P44)","v":0},null,null,{"$f":"IF(W2=2,0,IF(O45<=150000,O45,150000))","v":0},null,null,null,null,"nps direct pay",{"$f":"INVEST!F15","v":0}]
[null,10,"a. ","Contrubution to National Pension Scheme - NPS Section 80CCD(1B) Investment upto 50000 can be made additionally",null,null,null,null,null,null,null,null,null,":",{"$f":"AD41","v":0},null,null,null,null,null,null,null,"total NPS",{"$f":"X44+X45","v":0}]
[null,null,"b.","Employer's contribution to NPS [Up to 10% Pay+Da+AGPgets excemption u/s Section 80CCD(2)]",null,null,null,null,null,null,null,null,null,null,{"$f":"IF(Z47<X47,Z47,X47)","v":0},null,null,null,null,null,null,null,"total pay+da+agp 10% =",{"$f":"ROUND(AA47*0.1,0)","v":0},"Empr contri =",{"$f":"'det.sal input'!W32","v":0},{"$f":"'det.sal input'!C26+'det.sal input'!D26+'det.sal input'!F26-'det.sal input'!C20","v":0}]
[null,null,"c.","Investment in Rajiv Gandhi Equity Savings Scheme 80CCG (50% of investment gets exemption.Maximum 25000)"]
[null,null,"c) ","Mediclaim ( Maximum of Rs.25,000 for self, spouse, children and Rs.25000 for Parents. if Parents are senior citizens Rs. 30,000)(80 D)",null,null,null,null,null,null,null,null,null,":",{"$f":"IF(Z49<X49,Z49,X49)","v":0},null,null,null,null,null,null,null,"max 80 D=",55000,"Actual 80d =",{"$f":"INVEST!F18","v":0}]
[null,null,"d) ","Expenditure on Medical treatment of mentally or physically handicapped dependents (including Specified investments there on). ( Max. Rs.75,000/- in case of severe disability max. Rs.1,25,000) (80DD)",null,null,null,null,null,null,null,null,null,":",{"$f":"IF(Z50<X50,Z50,X50)","v":0},null,null,null,null,null,null,null,"max 80dd=",125000,"Actual 80dd =",{"$f":"INVEST!F21","v":0}]
[null,null,"e) ","For medical treatment of specified diseases of self/dependent . Actual exp. Or Rs. 40000/60000/ 80000 which ever is less gets excemption depending on age. Should submit Form-10-I. (80 DDB)",null,null,null,null,null,null,null,null,null,null,{"$f":"INVEST!F22","v":0}]
[null,null,"f)","Any amount of interest paid for Educational Loan  for higher education of the employee's dependent children [u/s 80E]",null,null,null,null,null,null,null,null,null,":",{"$f":"INVEST!F20","v":0}]
[null,null,"g) ","Additional deduction on housing loan interest (maximum 50000) if the following conditions are satisfied. 1. loan amount is not above Rs. 35 lakhs,  2.  Loan sanctioned in 2016-17,  3. He is a first time home buyer,   4.  cost of house does not exceed Rs. 50 lakhs (80EE)",null,null,null,null,null,null,null,null,null,null,{"$f":"IF(W53<0,0,W53)","v":0},null,null,null,null,null,null,null,{"$f":"IF(PERSONAL!H20=\"YES\",'new statement (2)'!X23-'new statement (2)'!W23,0)","v":0}]
[null,null,"h) ",{"$f":"'new statement'!D54:M54","v":"Electric vehicle loan interest repayment (up to 1.5 Lakh) (80EEB)"},null,null,null,null,null,null,null,null,null,null,{"$f":"'new statement'!O54:P54","v":0}]
[null,null,"i)"," Donation to special funds only  PM's National Relief Fund,  Earth quake fund Etc (80G)",null,null,null,null,null,null,null,null,null,":",{"$f":"INVEST!F19+S96","v":0}]
[null,null,"j)","Dedution for differently abled Employees( 80U)For blindness,Hearing impaired, Mental retradation, Mental illness, low vision, Locomotors disability.  Fixed deduction of 75000 (For disability not less than 40%)  / 1.25 Lakh, for severe disability over 80% ",null,null,null,null,null,null,null,null,null,":",{"$f":"INVEST!F23","v":0}]
[null,null,null,"Total of 10",null,null,null,null,null,null,null,null,null,null,{"$f":"SUM(O46:P56)","v":0}]
[null,11,"Total Deduction   (9+10)",null,null,null,null,null,null,null,null,null,null,null,null,null,null,{"$f":"IF(W2=2,O47,R45+O57)","v":0}]
[null,12,"Total Income or Taxable Income  (rounded off to the nearest multiple of ten (8-11)",null,null,null,null,null,null,null,null,null,null,null,"Before rounding",null,{"$f":"R27-R58","v":0},{"$f":"IF(R27-R58>0,ROUND(((R27-R58)/10),0)*10,0)","v":0}]
[null,13,"Tax on Total Income (New rate option) First 3 Lakh, Nil, next 3 Lakh 5%, next 3 Lakh 10%, next 3 Lakh 15%,  next 3 Lakh 20%,  Remaining income 30%",null,null,null,null,null,null,null,null,null,null,null,null,null,":",{"$f":"IF(W2=2,AC40,'new form 16'!J81)","v":0}]
[null,14,"Less 87 A Rebate, upto a maximum of Rs.25000, available only if Taxable income is less than 700001 (Rebate u/s 87A)",null,null,null,null,null,null,null,null,null,null,null,null,null,null,{"$f":"IF(R60=0,0,IF(R59>700000,0,IF(25000>R60,R60,25000)))","v":0}]
[null,15,"Balance of Tax after 87A rebate ",null,null,null,null,null,null,null,null,null,null,null,null,null,null,{"$f":"R60-R61","v":0}]
[null,16,"Education Cess @ 4% of  tax",null,null,null,null,null,null,null,null,null,null,null,null,null,":",{"$f":"ROUND(R62*0.04,0)","v":0}]
[null,17,"Total Tax Payable (13-14+16)",null,null,null,null,null,null,null,null,null,null,null,null,null,":",{"$f":"R62+R63","v":0},null,null,null,null,{"$f":"R64","v":0}]
[null,18,"Less : Relief for Arrears of Salary u/s 89(1) attach 10 E set of forms and previous years tax statements",null,null,null,null,null,null,null,null,null,null,null,null,null,":",{"$f":"'ARR MONH SPLIT'!I107","v":0},null,null,null,{"$f":"IF('Form 10E NEW REG'!B2=\"\",\"\",\"ERROR\")","v":""},{"$f":"IF(INVEST!F24>R64,R64,'Form 10E'!H40)","v":0}]
[null,19,"Balance Tax Payable (17-18) rounded to 10 rupees.",null,null,null,null,null,null,null,null,{"$f":"\"( before rounding \"&ROUND(R64-R65,0)&\") \"","v":"( before rounding 0) "},null,null,null,null,":",{"$f":"ROUND((R64-R65),-1)","v":0}]
[null,20,"Amount of Tax already deducted from salary (TDS)",null,null,null,null,null,null,null,null,null,null,null,null,null,":",{"$f":"'det.sal input'!Q26","v":0}]
[null,21,"Amount of Tax deducted from interest on deposits (FD,RD etc ), Capital Gain, Profession Income",null,null,null,null,null,null,null,null,null,null,null,null,null,null,{"$f":"'tds det'!I37","v":0},null,null,null,null,{"$f":"R66-R68-R69","v":0},{"$f":"ROUND(W68,-1)","v":0}]
[null,22,"Advance tax/ other TDS paid (Challan pay) details :",null,null,null,null,null,null,null,null,null,null,{"$f":"'tds det'!D18&\", \"&'tds det'!E47","v":"0, "},null,null,null,{"$f":"'tds det'!I38","v":0}]
[null,23,{"$f":"IF(R70>=0,\"Balance of Tax  to be deducted now (19-20-21-22) \",\"Excess TDS payment made, can apply for refund during e-filing\")","v":"Balance of Tax  to be deducted now (19-20-21-22) "},null,null,null,null,null,null,null,null,null,null,{"$f":"\"Before rounding \"&R64-R65-R67-R68-R69","v":"Before rounding 0"},null,null,null,{"$f":"ROUND((R66-R67-R68-R69),0)","v":0},null,null,null,null,{"$f":"ROUND(R70,-1)","v":0}]
[null,24,{"$f":"\"Monthly TDS amount  required in the next  \"&PERSONAL!H21&\" month(s)\"","v":"Monthly TDS amount  required in the next  3 month(s)"},null,null,null,null,null,null,null,null,null,null,null,null,null,null,null,null,{"$f":"IF(R70<1,0,R70/PERSONAL!H21)","v":0}]
[null,{"$f":"FACE!D1&\" version\"","v":"2023 December 21 version"}]
[null,{"$f":"\"True copy, Counter signed by \"&CUSTOMISE!H24&\", \"&CUSTOMISE!H26","v":"True copy, Counter signed by , "},null,null,null,null,null,null,null,null,null,null,null,null,null,null,null,null,null,null,null,{"$f":"PERSONAL!H4&\", \"&PERSONAL!H6","v":", "},"10 ലേക്ക് ROUND  ചെയ്ത നികുതി സംഖ്യയാണ് ശരിയായ നികുതി. "]
[null,{"$f":"\"Place: \"&PERSONAL!H11","v":"Place: 0"},null,null,null,null,null,null,null,null,null,null,null,null,"http://babuvadukkumchery.blogspot.com",null,null,null,null,null,null,null,"ROUND  ചെയ്യാത്ത തുക ഇവിടെ വെറുതെ  അറിവിലേക്കായി നല്‍കീ എന്നേ കരുതേണ്ടൂ "]
[null,"Date :",null,{"$f":"TEXT(TODAY(),\"dd/mm/yyyy\")","v":"05/02/2024"}]
[null,{"$f":"IF(print!P9=\"ANTICIPATORY TAX CALCULATOR\",\"DETAILS OF EXPECTED SALARY AND DEDUCTIONS  FOR THE FINANCIAL YEAR 2023-24\",\"DETAILS OF  SALARY AND DEDUCTIONS  FOR THE FINANCIAL YEAR 2023-24\")","v":"DETAILS OF EXPECTED SALARY AND DEDUCTIONS  FOR THE FINANCIAL YEAR 2023-24"}]
[null,null,null,{"$f":"IF('det.sal input'!$B$6=\"pension\",\"PENSION RECEIPTS\",\"SALARY RECEIPTS\")","v":"SALARY RECEIPTS"},null,null,null,null,null,null,null,null,"DEDUCTIONS FROM OFFICE"]
[null," For the Month",null,"Pay /Pension","AGP","DA","HRA",{"$f":"UPPER('det.sal input'!H6)","v":"?"},{"$f":"UPPER('det.sal input'!I6)","v":"?"},{"$f":"UPPER('det.sal input'!J6)","v":"?"},{"$f":"UPPER('det.sal input'!K6)","v":"?"},"Total",{"$f":"'det.sal input'!M6","v":"PF"},{"$f":"'det.sal input'!N6","v":"SLI"},{"$f":"'det.sal input'!O6","v":"GI"},"LIC/PLI","TDS",{"$f":"UPPER('det.sal input'!R6&\"+ \"&'det.sal input'!T6)","v":"?+ ?"},{"$f":"'new statement'!S78","v":"Donation - Office deduction only 80 G"},{"$f":"'det.sal input'!U6","v":" (NPS)"},{"$f":"'new statement'!U78","v":"MEDISEP (S-80 D)"},{"$f":"'det.sal input'!W6","v":"TOTAL DEDUCTIONS"}]
[null,{"$f":"IF('det.sal input'!$B$6=\"pension\",\"April-23\",\"March-23\")","v":"March-23"},null,{"$f":"'det.sal input'!C8","v":0},{"$f":"'det.sal input'!D8","v":0},{"$f":"'det.sal input'!F8","v":0},{"$f":"'det.sal input'!G8","v":0},{"$f":"'det.sal input'!H8","v":0},{"$f":"'det.sal input'!I8","v":0},{"$f":"'det.sal input'!J8","v":0},{"$f":"'det.sal input'!K8","v":0},{"$f":"'det.sal input'!L8","v":0},{"$f":"'det.sal input'!M8","v":0},{"$f":"'det.sal input'!N8","v":0},{"$f":"'det.sal input'!O8","v":0},{"$f":"'det.sal input'!P8","v":0},{"$f":"'det.sal input'!Q8","v":0},{"$f":"'det.sal input'!R8+'det.sal input'!T8","v":0},{"$f":"'det.sal input'!S8","v":0},{"$f":"'det.sal input'!U8","v":0},{"$f":"'new statement'!U79","v":0},{"$f":"'det.sal input'!W8","v":0}]
[null,{"$f":"IF('det.sal input'!$B$6=\"pension\",\"May\",\"April\")","v":"April"},null,{"$f":"'det.sal input'!C9","v":0},{"$f":"'det.sal input'!D9","v":0},{"$f":"'det.sal input'!F9","v":0},{"$f":"'det.sal input'!G9","v":0},{"$f":"'det.sal input'!H9","v":0},{"$f":"'det.sal input'!I9","v":0},{"$f":"'det.sal input'!J9","v":0},{"$f":"'det.sal input'!K9","v":0},{"$f":"'det.sal input'!L9","v":0},{"$f":"'det.sal input'!M9","v":0},{"$f":"'det.sal input'!N9","v":0},{"$f":"'det.sal input'!O9","v":0},{"$f":"'det.sal input'!P9","v":0},{"$f":"'det.sal input'!Q9","v":0},{"$f":"'det.sal input'!R9+'det.sal input'!T9","v":0},{"$f":"'det.sal input'!S9","v":0},{"$f":"'det.sal input'!U9","v":0},{"$f":"'new statement'!U80","v":0},{"$f":"'det.sal input'!W9","v":0}]
[null,{"$f":"'det.sal input'!B10","v":"May"},null,{"$f":"'det.sal input'!C10","v":0},{"$f":"'det.sal input'!D10","v":0},{"$f":"'det.sal input'!F10","v":0},{"$f":"'det.sal input'!G10","v":0},{"$f":"'det.sal input'!H10","v":0},{"$f":"'det.sal input'!I10","v":0},{"$f":"'det.sal input'!J10","v":0},{"$f":"'det.sal input'!K10","v":0},{"$f":"'det.sal input'!L10","v":0},{"$f":"'det.sal input'!M10","v":0},{"$f":"'det.sal input'!N10","v":0},{"$f":"'det.sal input'!O10","v":0},{"$f":"'det.sal input'!P10","v":0},{"$f":"'det.sal input'!Q10","v":0},{"$f":"'det.sal input'!R10+'det.sal input'!T10","v":0},{"$f":"'det.sal input'!S10","v":0},{"$f":"'det.sal input'!U10","v":0},{"$f":"'new statement'!U81","v":0},{"$f":"'det.sal input'!W10","v":0}]
[null,{"$f":"'det.sal input'!B11","v":"June"},null,{"$f":"'det.sal input'!C11","v":0},{"$f":"'det.sal input'!D11","v":0},{"$f":"'det.sal input'!F11","v":0},{"$f":"'det.sal input'!G11","v":0},{"$f":"'det.sal input'!H11","v":0},{"$f":"'det.sal input'!I11","v":0},{"$f":"'det.sal input'!J11","v":0},{"$f":"'det.sal input'!K11","v":0},{"$f":"'det.sal input'!L11","v":0},{"$f":"'det.sal input'!M11","v":0},{"$f":"'det.sal input'!N11","v":0},{"$f":"'det.sal input'!O11","v":0},{"$f":"'det.sal input'!P11","v":0},{"$f":"'det.sal input'!Q11","v":0},{"$f":"'det.sal input'!R11+'det.sal input'!T11","v":0},{"$f":"'det.sal input'!S11","v":0},{"$f":"'det.sal input'!U11","v":0},{"$f":"'new statement'!U82","v":0},{"$f":"'det.sal input'!W11","v":0}]
[null,{"$f":"'det.sal input'!B12","v":"July"},null,{"$f":"'det.sal input'!C12","v":0},{"$f":"'det.sal input'!D12","v":0},{"$f":"'det.sal input'!F12","v":0},{"$f":"'det.sal input'!G12","v":0},{"$f":"'det.sal input'!H12","v":0},{"$f":"'det.sal input'!I12","v":0},{"$f":"'det.sal input'!J12","v":0},{"$f":"'det.sal input'!K12","v":0},{"$f":"'det.sal input'!L12","v":0},{"$f":"'det.sal input'!M12","v":0},{"$f":"'det.sal input'!N12","v":0},{"$f":"'det.sal input'!O12","v":0},{"$f":"'det.sal input'!P12","v":0},{"$f":"'det.sal input'!Q12","v":0},{"$f":"'det.sal input'!R12+'det.sal input'!T12","v":0},{"$f":"'det.sal input'!S12","v":0},{"$f":"'det.sal input'!U12","v":0},{"$f":"'new statement'!U83","v":0},{"$f":"'det.sal input'!W12","v":0}]
[null,{"$f":"'det.sal input'!B13","v":"August"},null,{"$f":"'det.sal input'!C13","v":0},{"$f":"'det.sal input'!D13","v":0},{"$f":"'det.sal input'!F13","v":0},{"$f":"'det.sal input'!G13","v":0},{"$f":"'det.sal input'!H13","v":0},{"$f":"'det.sal input'!I13","v":0},{"$f":"'det.sal input'!J13","v":0},{"$f":"'det.sal input'!K13","v":0},{"$f":"'det.sal input'!L13","v":0},{"$f":"'det.sal input'!M13","v":0},{"$f":"'det.sal input'!N13","v":0},{"$f":"'det.sal input'!O13","v":0},{"$f":"'det.sal input'!P13","v":0},{"$f":"'det.sal input'!Q13","v":0},{"$f":"'det.sal input'!R13+'det.sal input'!T13","v":0},{"$f":"'det.sal input'!S13","v":0},{"$f":"'det.sal input'!U13","v":0},{"$f":"'new statement'!U84","v":0},{"$f":"'det.sal input'!W13","v":0}]
[null,{"$f":"'det.sal input'!B14","v":"September"},null,{"$f":"'det.sal input'!C14","v":0},{"$f":"'det.sal input'!D14","v":0},{"$f":"'det.sal input'!F14","v":0},{"$f":"'det.sal input'!G14","v":0},{"$f":"'det.sal input'!H14","v":0},{"$f":"'det.sal input'!I14","v":0},{"$f":"'det.sal input'!J14","v":0},{"$f":"'det.sal input'!K14","v":0},{"$f":"'det.sal input'!L14","v":0},{"$f":"'det.sal input'!M14","v":0},{"$f":"'det.sal input'!N14","v":0},{"$f":"'det.sal input'!O14","v":0},{"$f":"'det.sal input'!P14","v":0},{"$f":"'det.sal input'!Q14","v":0},{"$f":"'det.sal input'!R14+'det.sal input'!T14","v":0},{"$f":"'det.sal input'!S14","v":0},{"$f":"'det.sal input'!U14","v":0},{"$f":"'new statement'!U85","v":0},{"$f":"'det.sal input'!W14","v":0}]
[{"$f":"FACE!D1","v":"2023 December 21"},{"$f":"'det.sal input'!B15","v":"October"},null,{"$f":"'det.sal input'!C15","v":0},{"$f":"'det.sal input'!D15","v":0},{"$f":"'det.sal input'!F15","v":0},{"$f":"'det.sal input'!G15","v":0},{"$f":"'det.sal input'!H15","v":0},{"$f":"'det.sal input'!I15","v":0},{"$f":"'det.sal input'!J15","v":0},{"$f":"'det.sal input'!K15","v":0},{"$f":"'det.sal input'!L15","v":0},{"$f":"'det.sal input'!M15","v":0},{"$f":"'det.sal input'!N15","v":0},{"$f":"'det.sal input'!O15","v":0},{"$f":"'det.sal input'!P15","v":0},{"$f":"'det.sal input'!Q15","v":0},{"$f":"'det.sal input'!R15+'det.sal input'!T15","v":0},{"$f":"'det.sal input'!S15","v":0},{"$f":"'det.sal input'!U15","v":0},{"$f":"'new statement'!U86","v":0},{"$f":"'det.sal input'!W15","v":0}]
[null,{"$f":"'det.sal input'!B16","v":"November"},null,{"$f":"'det.sal input'!C16","v":0},{"$f":"'det.sal input'!D16","v":0},{"$f":"'det.sal input'!F16","v":0},{"$f":"'det.sal input'!G16","v":0},{"$f":"'det.sal input'!H16","v":0},{"$f":"'det.sal input'!I16","v":0},{"$f":"'det.sal input'!J16","v":0},{"$f":"'det.sal input'!K16","v":0},{"$f":"'det.sal input'!L16","v":0},{"$f":"'det.sal input'!M16","v":0},{"$f":"'det.sal input'!N16","v":0},{"$f":"'det.sal input'!O16","v":0},{"$f":"'det.sal input'!P16","v":0},{"$f":"'det.sal input'!Q16","v":0},{"$f":"'det.sal input'!R16+'det.sal input'!T16","v":0},{"$f":"'det.sal input'!S16","v":0},{"$f":"'det.sal input'!U16","v":0},{"$f":"'new statement'!U87","v":0},{"$f":"'det.sal input'!W16","v":0}]
[null,{"$f":"'det.sal input'!B17","v":"December"},null,{"$f":"'det.sal input'!C17","v":0},{"$f":"'det.sal input'!D17","v":0},{"$f":"'det.sal input'!F17","v":0},{"$f":"'det.sal input'!G17","v":0},{"$f":"'det.sal input'!H17","v":0},{"$f":"'det.sal input'!I17","v":0},{"$f":"'det.sal input'!J17","v":0},{"$f":"'det.sal input'!K17","v":0},{"$f":"'det.sal input'!L17","v":0},{"$f":"'det.sal input'!M17","v":0},{"$f":"'det.sal input'!N17","v":0},{"$f":"'det.sal input'!O17","v":0},{"$f":"'det.sal input'!P17","v":0},{"$f":"'det.sal input'!Q17","v":0},{"$f":"'det.sal input'!R17+'det.sal input'!T17","v":0},{"$f":"'det.sal input'!S17","v":0},{"$f":"'det.sal input'!U17","v":0},{"$f":"'new statement'!U88","v":0},{"$f":"'det.sal input'!W17","v":0}]
[null,{"$f":"'det.sal input'!B18","v":"Jan- 2024"},null,{"$f":"'det.sal input'!C18","v":0},{"$f":"'det.sal input'!D18","v":0},{"$f":"'det.sal input'!F18","v":0},{"$f":"'det.sal input'!G18","v":0},{"$f":"'det.sal input'!H18","v":0},{"$f":"'det.sal input'!I18","v":0},{"$f":"'det.sal input'!J18","v":0},{"$f":"'det.sal input'!K18","v":0},{"$f":"'det.sal input'!L18","v":0},{"$f":"'det.sal input'!M18","v":0},{"$f":"'det.sal input'!N18","v":0},{"$f":"'det.sal input'!O18","v":0},{"$f":"'det.sal input'!P18","v":0},{"$f":"'det.sal input'!Q18","v":0},{"$f":"'det.sal input'!R18+'det.sal input'!T18","v":0},{"$f":"'det.sal input'!S18","v":0},{"$f":"'det.sal input'!U18","v":0},{"$f":"'new statement'!U89","v":0},{"$f":"'det.sal input'!W18","v":0}]
[null,{"$f":"'det.sal input'!B19","v":"Feb-2024"},null,{"$f":"'det.sal input'!C19","v":0},{"$f":"'det.sal input'!D19","v":0},{"$f":"'det.sal input'!F19","v":0},{"$f":"'det.sal input'!G19","v":0},{"$f":"'det.sal input'!H19","v":0},{"$f":"'det.sal input'!I19","v":0},{"$f":"'det.sal input'!J19","v":0},{"$f":"'det.sal input'!K19","v":0},{"$f":"'det.sal input'!L19","v":0},{"$f":"'det.sal input'!M19","v":0},{"$f":"'det.sal input'!N19","v":0},{"$f":"'det.sal input'!O19","v":0},{"$f":"'det.sal input'!P19","v":0},{"$f":"'det.sal input'!Q19+R70","v":0},{"$f":"'det.sal input'!R19+'det.sal input'!T19","v":0},{"$f":"'det.sal input'!S19","v":0},{"$f":"'det.sal input'!U19","v":0},{"$f":"'new statement'!U90","v":0},{"$f":"'det.sal input'!W19","v":0}]
[null,"Fest. All",null,{"$f":"'det.sal input'!C20","v":0},null,null,null,null,null,null,null,{"$f":"'det.sal input'!L20","v":0},null,null,null,null,null,null,{"$f":"'det.sal input'!S20","v":0}]
[null,"Arrear","PF",{"$f":"'det.sal input'!C21","v":0},{"$f":"'det.sal input'!D21","v":0},{"$f":"'det.sal input'!F21","v":0},{"$f":"'det.sal input'!G21","v":0},{"$f":"'det.sal input'!H21","v":0},{"$f":"'det.sal input'!I21","v":0},{"$f":"'det.sal input'!J21","v":0},{"$f":"'det.sal input'!K21","v":0},{"$f":"'det.sal input'!L21","v":0},{"$f":"'det.sal input'!M21","v":0},{"$f":"'det.sal input'!N21","v":0},{"$f":"'det.sal input'!O21","v":0},{"$f":"'det.sal input'!P21","v":0},{"$f":"'det.sal input'!Q21","v":0},{"$f":"'det.sal input'!R21+'det.sal input'!T21","v":0},{"$f":"'det.sal input'!S21","v":0},{"$f":"'det.sal input'!U21","v":0},null,{"$f":"'det.sal input'!W21","v":0}]
[null,null,"CASH/NPS",{"$f":"'det.sal input'!C22","v":0},{"$f":"'det.sal input'!D22","v":0},{"$f":"'det.sal input'!F22","v":0},{"$f":"'det.sal input'!G22","v":0},{"$f":"'det.sal input'!H22","v":0},{"$f":"'det.sal input'!I22","v":0},{"$f":"'det.sal input'!J22","v":0},{"$f":"'det.sal input'!K22","v":0},{"$f":"'det.sal input'!L22","v":0},{"$f":"'det.sal input'!M22","v":0},{"$f":"'det.sal input'!N22","v":0},{"$f":"'det.sal input'!O22","v":0},{"$f":"'det.sal input'!P22","v":0},{"$f":"'det.sal input'!Q22","v":0},{"$f":"'det.sal input'!R22+'det.sal input'!T22","v":0},{"$f":"'det.sal input'!S22","v":0},{"$f":"'det.sal input'!U22","v":0},null,{"$f":"'det.sal input'!W22","v":0}]
[null,"Leave surrender",null,{"$f":"'det.sal input'!C23","v":0},{"$f":"'det.sal input'!D23","v":0},{"$f":"'det.sal input'!F23","v":0},{"$f":"'det.sal input'!G23","v":0},{"$f":"'det.sal input'!H23","v":0},{"$f":"'det.sal input'!I23","v":0},{"$f":"'det.sal input'!J23","v":0},{"$f":"'det.sal input'!K23","v":0},{"$f":"'det.sal input'!L23","v":0},{"$f":"'det.sal input'!M23","v":0},{"$f":"'det.sal input'!N23","v":0},{"$f":"'det.sal input'!O23","v":0},{"$f":"'det.sal input'!P23","v":0},{"$f":"'det.sal input'!Q23","v":0},{"$f":"'det.sal input'!R23+'det.sal input'!T23","v":0},{"$f":"'det.sal input'!S23","v":0},{"$f":"'det.sal input'!U23","v":0},null,{"$f":"'det.sal input'!W23","v":0}]
[null,"Deferred Salary Arrear",null,{"$f":"'det.sal input'!C25","v":0},{"$f":"'det.sal input'!D24","v":0},{"$f":"'det.sal input'!F24","v":0},{"$f":"'det.sal input'!G24","v":0},{"$f":"'det.sal input'!H24","v":0},{"$f":"'det.sal input'!I24","v":0},{"$f":"'det.sal input'!J24","v":0},{"$f":"'det.sal input'!K24","v":0},{"$f":"'det.sal input'!L25","v":0},{"$f":"'det.sal input'!M24","v":0},{"$f":"'det.sal input'!N24","v":0},{"$f":"'det.sal input'!O24","v":0},{"$f":"'det.sal input'!P24","v":0},{"$f":"'det.sal input'!Q24","v":0},{"$f":"'det.sal input'!R24+'det.sal input'!T24","v":0},{"$f":"'det.sal input'!S24","v":0},{"$f":"'det.sal input'!U24","v":0},null,{"$f":"'det.sal input'!W24","v":0}]
[null,"Total *",null,{"$f":"'det.sal input'!C26","v":0},{"$f":"'det.sal input'!D26","v":0},{"$f":"'det.sal input'!F26","v":0},{"$f":"'det.sal input'!G26","v":0},{"$f":"'det.sal input'!H26","v":0},{"$f":"'det.sal input'!I26","v":0},{"$f":"'det.sal input'!J26","v":0},{"$f":"'det.sal input'!K26","v":0},{"$f":"'det.sal input'!L26","v":0},{"$f":"'det.sal input'!M26","v":0},{"$f":"'det.sal input'!N26","v":0},{"$f":"'det.sal input'!O26","v":0},{"$f":"'det.sal input'!P26","v":0},{"$f":"SUM(Q79:Q89)+SUM(Q91:Q95)+Q90","v":0},{"$f":"'det.sal input'!R26+'det.sal input'!T26","v":0},{"$f":"'det.sal input'!S26","v":0},{"$f":"'det.sal input'!U26","v":0},{"$f":"SUM(U79:U95)","v":0},{"$f":"SUM(V79:V95)","v":0}]
[null,{"$f":"IF('det.sal input'!C24=\"\",\"\",\"* Total includes other office receipts or refunds\")","v":""}]
[null,null,null,{"$f":"IF(#REF!<0,\"Refund of salary\",\"Other receipts from office\")","v":{"$error":"#REF!"}},null,null,null,null,null,null,null,null,null,null,null,null,null,{"$f":"ROUND(W69,-1)","v":0}]
[]
[]
[]
[]
[]
[]
[]
[]
[]
[]
[]
[]
[]
[]
[]
[]
[]
[]
[]
[]
[]
[]
[]
[]
[]
[]
[]
[]
[]
[]
[]
[]
[]
[]
[]
[]
[]
[]
[]
[]
[]
[]
[]
[]
[]
[]
[]
[]
[]
[]
[]
[]
[]
[]
[]
[]
[]
[]
[]
[]
[]
[]
[]
[]
[]
[]
[]
[]
[]
[]
[]
[]
[]
[]
[]
[]
[]
[]
[]
[]
[]
[]
[]
[]
[]
[]
[]
[]
[]
[]
[]
[]
[]
[]
[]
[]
[]
[]
[]
[]
[]
[]
[]
[]
[]
[]
[]
[]
[]
[]
[]
[]
[]
[]
[]
[]
[]
[]
[]
[]
[]
[]
[]
[null,null,null,null,null,null,null,null,null,null,null,null,null,null,null,null,null,null,null,null,null,null,null,null,null,null,null,null,null,null,"Male",{"$f":"IF(AND(R59>200000,R59<=500000),(R59-200000)*0.1,IF(AND(R59>500000,R59<=1000000),30000+(R59-500000)*0.2,IF(R59>1000000,130000+(R59-1000000)*0.3,\"Nil\")))","v":"Nil"}]
[null,null,null,null,null,null,null,null,null,null,null,null,null,null,null,null,null,null,null,null,null,null,null,null,null,null,null,null,null,null,"Female",{"$f":"IF(AND(R59>200000,R59<=500000),(R59-200000)*0.1,IF(AND(R59>500000,R59<=1000000),30000+(R59-500000)*0.2,IF(R59>1000000,130000+(R59-1000000)*0.3,\"Nil\")))","v":"Nil"}]
[null,null,null,null,null,null,null,null,null,null,null,null,null,null,null,null,null,null,null,null,null,null,null,null,null,null,null,null,null,null,"Senior",{"$f":"IF(AND(R59>250000,R59<=500000),(R59-250000)*0.1,IF(AND(R59>500000,R59<=1000000),25000+(R59-500000)*0.2,IF(R59>1000000,125000+(R59-1000000)*0.3,\"Nil\")))","v":"Nil"}]
[null,null,null,null,null,null,null,null,null,null,null,null,null,null,null,null,null,null,null,null,null,null,null,null,null,null,null,null,null,null,"Senior2",{"$f":"IF(AND(R59>500000,R59<=1000000),(R59-500000)*0.2,IF(R59>1000000,100000+(R59-1000000)*0.3,\"Nil\"))","v":"Nil"}]
[]
[]
[]
[null,null,null,null,null,null,null,null,null,null,null,null,null,null,null,null,null,null,null,null,null,null,null,null,null,null,null,null,null,null,{"$f":"IF(O30<>\"Nil\",\"Life Insurance Premum\",\"\")","v":"Life Insurance Premum"},{"$f":"IF(O30<>\"Nil\",O30,\"\")","v":0},{"$f":"IF(ROW()-ROW(two)+1>ROWS(one)-COUNTBLANK(one),\"\",INDIRECT(ADDRESS(SMALL((IF(one<>\"\",ROW(one),ROW()+ROWS(one))),ROW()-ROW(two)+1),COLUMN(one),4)))","v":{"$error":"#REF!"}},{"$f":"IF(AG229<>\"\",VLOOKUP(AG229,AE229:AF242,2,FALSE),\"\")","v":{"$error":"#REF!"}}]
[null,null,null,null,null,null,null,null,null,null,null,null,null,null,null,null,null,null,null,null,null,null,null,null,null,null,null,null,null,null,{"$f":"IF(#REF!<>\"Nil\",\"Purchase of NSC\",\"\")","v":{"$error":"#REF!"}},{"$f":"IF(#REF!<>\"Nil\",#REF!,\"\")","v":{"$error":"#REF!"}},{"$f":"IF(ROW()-ROW(two)+1>ROWS(one)-COUNTBLANK(one),\"\",INDIRECT(ADDRESS(SMALL((IF(one<>\"\",ROW(one),ROW()+ROWS(one))),ROW()-ROW(two)+1),COLUMN(one),4)))","v":{"$error":"#REF!"}},{"$f":"IF(AG230<>\"\",VLOOKUP(AG230,AE230:AF245,2,FALSE),\"\")","v":{"$error":"#REF!"}}]
[null,null,null,null,null,null,null,null,null,null,null,null,null,null,null,null,null,null,null,null,null,null,null,null,null,null,null,null,null,null,{"$f":"IF(O32<>\"Nil\",\"State Life Insurance (SLI)\",\"\")","v":"State Life Insurance (SLI)"},{"$f":"IF(O32<>\"Nil\",O32,\"\")","v":0},{"$f":"IF(ROW()-ROW(two)+1>ROWS(one)-COUNTBLANK(one),\"\",INDIRECT(ADDRESS(SMALL((IF(one<>\"\",ROW(one),ROW()+ROWS(one))),ROW()-ROW(two)+1),COLUMN(one),4)))","v":{"$error":"#REF!"}},{"$f":"IF(AG231<>\"\",VLOOKUP(AG231,AE231:AF246,2,FALSE),\"\")","v":{"$error":"#REF!"}}]
[null,null,null,null,null,null,null,null,null,null,null,null,null,null,null,null,null,null,null,null,null,null,null,null,null,null,null,null,null,null,{"$f":"IF(O33<>\"Nil\",\"Group Insurance Scheme (GIS)\",\"\")","v":"Group Insurance Scheme (GIS)"},{"$f":"IF(O33<>\"Nil\",O33,\"\")","v":0},{"$f":"IF(ROW()-ROW(two)+1>ROWS(one)-COUNTBLANK(one),\"\",INDIRECT(ADDRESS(SMALL((IF(one<>\"\",ROW(one),ROW()+ROWS(one))),ROW()-ROW(two)+1),COLUMN(one),4)))","v":{"$error":"#REF!"}},{"$f":"IF(AG232<>\"\",VLOOKUP(AG232,AE232:AF247,2,FALSE),\"\")","v":{"$error":"#REF!"}}]
[null,null,null,null,null,null,null,null,null,null,null,null,null,null,null,null,null,null,null,null,null,null,null,null,null,null,null,null,null,null,{"$f":"IF(#REF!<>\"Nil\",\"Group Personal Accident Insurance (GPAIS)\",\"\")","v":{"$error":"#REF!"}},{"$f":"IF(#REF!<>\"Nil\",#REF!,\"\")","v":{"$error":"#REF!"}},{"$f":"IF(ROW()-ROW(two)+1>ROWS(one)-COUNTBLANK(one),\"\",INDIRECT(ADDRESS(SMALL((IF(one<>\"\",ROW(one),ROW()+ROWS(one))),ROW()-ROW(two)+1),COLUMN(one),4)))","v":{"$error":"#REF!"}},{"$f":"IF(AG233<>\"\",VLOOKUP(AG233,AE233:AF248,2,FALSE),\"\")","v":{"$error":"#REF!"}}]
[null,null,null,null,null,null,null,null,null,null,null,null,null,null,null,null,null,null,null,null,null,null,null,null,null,null,null,null,null,null,{"$f":"IF(O34<>\"Nil\",D34,\"\")","v":"Life Insurence  salary deduction"},{"$f":"IF(O34<>\"Nil\",O34,\"\")","v":0},{"$f":"IF(ROW()-ROW(two)+1>ROWS(one)-COUNTBLANK(one),\"\",INDIRECT(ADDRESS(SMALL((IF(one<>\"\",ROW(one),ROW()+ROWS(one))),ROW()-ROW(two)+1),COLUMN(one),4)))","v":{"$error":"#REF!"}},{"$f":"IF(AG234<>\"\",VLOOKUP(AG234,AE234:AF249,2,FALSE),\"\")","v":{"$error":"#REF!"}}]
[null,null,null,null,null,null,null,null,null,null,null,null,null,null,null,null,null,null,null,null,null,null,null,null,null,null,null,null,null,null,{"$f":"IF(O35<>\"Nil\",\"Provident Fund\",\"\")","v":"Provident Fund"},{"$f":"IF(O35<>\"Nil\",O35,\"\")","v":0},{"$f":"IF(ROW()-ROW(two)+1>ROWS(one)-COUNTBLANK(one),\"\",INDIRECT(ADDRESS(SMALL((IF(one<>\"\",ROW(one),ROW()+ROWS(one))),ROW()-ROW(two)+1),COLUMN(one),4)))","v":{"$error":"#REF!"}},{"$f":"IF(AG235<>\"\",VLOOKUP(AG235,AE235:AF249,2,FALSE),\"\")","v":{"$error":"#REF!"}}]
[null,null,null,null,null,null,null,null,null,null,null,null,null,null,null,null,null,null,null,null,null,null,null,null,null,null,null,null,null,null,{"$f":"IF(O38<>\"Nil\",\"Unit Linked Insurance\",\"\")","v":"Unit Linked Insurance"},{"$f":"IF(O38<>\"Nil\",O38,\"\")","v":0},{"$f":"IF(ROW()-ROW(two)+1>ROWS(one)-COUNTBLANK(one),\"\",INDIRECT(ADDRESS(SMALL((IF(one<>\"\",ROW(one),ROW()+ROWS(one))),ROW()-ROW(two)+1),COLUMN(one),4)))","v":{"$error":"#REF!"}},{"$f":"IF(AG236<>\"\",VLOOKUP(AG236,AE236:AF250,2,FALSE),\"\")","v":{"$error":"#REF!"}}]
[null,null,null,null,null,null,null,null,null,null,null,null,null,null,null,null,null,null,null,null,null,null,null,null,null,null,null,null,null,null,{"$f":"IF(#REF!<>\"Nil\",\"Tax Saving Mutual Fund\",\"\")","v":{"$error":"#REF!"}},{"$f":"IF(#REF!<>\"Nil\",#REF!,\"\")","v":{"$error":"#REF!"}},{"$f":"IF(ROW()-ROW(two)+1>ROWS(one)-COUNTBLANK(one),\"\",INDIRECT(ADDRESS(SMALL((IF(one<>\"\",ROW(one),ROW()+ROWS(one))),ROW()-ROW(two)+1),COLUMN(one),4)))","v":{"$error":"#REF!"}},{"$f":"IF(AG237<>\"\",VLOOKUP(AG237,AE237:AF251,2,FALSE),\"\")","v":{"$error":"#REF!"}}]
[null,null,null,null,null,null,null,null,null,null,null,null,null,null,null,null,null,null,null,null,null,null,null,null,null,null,null,null,null,null,{"$f":"IF(O40<>\"Nil\",\"Tuition Fees\",\"\")","v":"Tuition Fees"},{"$f":"IF(O40<>\"Nil\",O40,\"\")","v":0},{"$f":"IF(ROW()-ROW(two)+1>ROWS(one)-COUNTBLANK(one),\"\",INDIRECT(ADDRESS(SMALL((IF(one<>\"\",ROW(one),ROW()+ROWS(one))),ROW()-ROW(two)+1),COLUMN(one),4)))","v":{"$error":"#REF!"}},{"$f":"IF(AG238<>\"\",VLOOKUP(AG238,AE237:AF252,2,FALSE),\"\")","v":{"$error":"#REF!"}}]
[null,null,null,null,null,null,null,null,null,null,null,null,null,null,null,null,null,null,null,null,null,null,null,null,null,null,null,null,null,null,{"$f":"IF(O41<>\"Nil\",\"Housing Loan Repayment\",\"\")","v":"Housing Loan Repayment"},{"$f":"IF(O41<>\"Nil\",O41,\"\")","v":0},{"$f":"IF(ROW()-ROW(two)+1>ROWS(one)-COUNTBLANK(one),\"\",INDIRECT(ADDRESS(SMALL((IF(one<>\"\",ROW(one),ROW()+ROWS(one))),ROW()-ROW(two)+1),COLUMN(one),4)))","v":{"$error":"#REF!"}},{"$f":"IF(AG239<>\"\",VLOOKUP(AG239,AE238:AF252,2,FALSE),\"\")","v":{"$error":"#REF!"}}]
[null,null,null,null,null,null,null,null,null,null,null,null,null,null,null,null,null,null,null,null,null,null,null,null,null,null,null,null,null,null,{"$f":"IF(#REF!<>\"Nil\",\"Eligibleshares & debentures\",\"\")","v":{"$error":"#REF!"}},{"$f":"IF(#REF!<>\"Nil\",#REF!,\"\")","v":{"$error":"#REF!"}},{"$f":"IF(ROW()-ROW(two)+1>ROWS(one)-COUNTBLANK(one),\"\",INDIRECT(ADDRESS(SMALL((IF(one<>\"\",ROW(one),ROW()+ROWS(one))),ROW()-ROW(two)+1),COLUMN(one),4)))","v":{"$error":"#REF!"}},{"$f":"IF(AG240<>\"\",VLOOKUP(AG240,AE238:AF252,2,FALSE),\"\")","v":{"$error":"#REF!"}}]
[null,null,null,null,null,null,null,null,null,null,null,null,null,null,null,null,null,null,null,null,null,null,null,null,null,null,null,null,null,null,{"$f":"IF(#REF!<>\"Nil\",\"Mutual Fund\",\"\")","v":{"$error":"#REF!"}},{"$f":"IF(#REF!<>\"Nil\",#REF!,\"\")","v":{"$error":"#REF!"}},{"$f":"IF(ROW()-ROW(two)+1>ROWS(one)-COUNTBLANK(one),\"\",INDIRECT(ADDRESS(SMALL((IF(one<>\"\",ROW(one),ROW()+ROWS(one))),ROW()-ROW(two)+1),COLUMN(one),4)))","v":{"$error":"#REF!"}},{"$f":"IF(AG241<>\"\",VLOOKUP(AG241,AE239:AF252,2,FALSE),\"\")","v":{"$error":"#REF!"}}]
[null,null,null,null,null,null,null,null,null,null,null,null,null,null,null,null,null,null,null,null,null,null,null,null,null,null,null,null,null,null,{"$f":"IF(#REF!<>\"Nil\",#REF!,\"\")","v":{"$error":"#REF!"}},{"$f":"IF(#REF!<>\"Nil\",#REF!,\"\")","v":{"$error":"#REF!"}},{"$f":"IF(ROW()-ROW(two)+1>ROWS(one)-COUNTBLANK(one),\"\",INDIRECT(ADDRESS(SMALL((IF(one<>\"\",ROW(one),ROW()+ROWS(one))),ROW()-ROW(two)+1),COLUMN(one),4)))","v":{"$error":"#REF!"}},{"$f":"IF(AG242<>\"\",VLOOKUP(AG242,AE240:AF252,2,FALSE),\"\")","v":{"$error":"#REF!"}}]
[null,null,null,null,null,null,null,null,null,null,null,null,null,null,null,null,null,null,null,null,null,null,null,null,null,null,null,null,null,null,null,null,{"$f":"IF(ROW()-ROW(two)+1>ROWS(one)-COUNTBLANK(one),\"\",INDIRECT(ADDRESS(SMALL((IF(one<>\"\",ROW(one),ROW()+ROWS(one))),ROW()-ROW(two)+1),COLUMN(one),4)))","v":""},{"$f":"IF(AG243<>\"\",VLOOKUP(AG243,AE241:AF252,2,FALSE),\"\")","v":""}]
[null,null,null,null,null,null,null,null,null,null,null,null,null,null,null,null,null,null,null,null,null,null,null,null,null,null,null,null,null,null,null,null,{"$f":"IF(ROW()-ROW(two)+1>ROWS(one)-COUNTBLANK(one),\"\",INDIRECT(ADDRESS(SMALL((IF(one<>\"\",ROW(one),ROW()+ROWS(one))),ROW()-ROW(two)+1),COLUMN(one),4)))","v":""},{"$f":"IF(AG244<>\"\",VLOOKUP(AG244,AE242:AF253,2,FALSE),\"\")","v":""}]
[]
[]
[null,null,null,null,null,null,null,null,null,null,null,null,null,null,null,null,null,null,null,null,null,null,null,null,null,null,null,null,null,null,{"$f":"IF('new statement (2)'!O49<>\"Nil\",\"Mediclaim Policies (Sec 80D)\",\"\")","v":"Mediclaim Policies (Sec 80D)"},{"$f":"IF(AE247<>\"\",O49,\"\")","v":0},{"$f":"IF(ROW()-ROW(four)+1>ROWS(three)-COUNTBLANK(three),\"\",INDIRECT(ADDRESS(SMALL((IF(three<>\"\",ROW(three),ROW()+ROWS(three))),ROW()-ROW(four)+1),COLUMN(three),4)))","v":{"$error":"#REF!"}},{"$f":"IF(ROW()-ROW(fouramt)+1>ROWS(threeamt)-COUNTBLANK(threeamt),\"\",INDIRECT(ADDRESS(SMALL((IF(threeamt<>\"\",ROW(threeamt),ROW()+ROWS(threeamt))),ROW()-ROW(fouramt)+1),COLUMN(threeamt),4)))","v":{"$error":"#REF!"}}]
[null,null,null,null,null,null,null,null,null,null,null,null,null,null,null,null,null,null,null,null,null,null,null,null,null,null,null,null,null,null,{"$f":"IF('new statement (2)'!O50<>\"Nil\",\"Medical Treatment Mentally or Physically handicapped (Sec-80DD)\",\"\")","v":"Medical Treatment Mentally or Physically handicapped (Sec-80DD)"},{"$f":"IF(AE248<>\"\",O50,\"\")","v":0},{"$f":"IF(ROW()-ROW(four)+1>ROWS(three)-COUNTBLANK(three),\"\",INDIRECT(ADDRESS(SMALL((IF(three<>\"\",ROW(three),ROW()+ROWS(three))),ROW()-ROW(four)+1),COLUMN(three),4)))","v":{"$error":"#REF!"}},{"$f":"IF(ROW()-ROW(fouramt)+1>ROWS(threeamt)-COUNTBLANK(threeamt),\"\",INDIRECT(ADDRESS(SMALL((IF(threeamt<>\"\",ROW(threeamt),ROW()+ROWS(threeamt))),ROW()-ROW(fouramt)+1),COLUMN(threeamt),4)))","v":{"$error":"#REF!"}}]
[null,null,null,null,null,null,null,null,null,null,null,null,null,null,null,null,null,null,null,null,null,null,null,null,null,null,null,null,null,null,{"$f":"IF('new statement (2)'!#REF!<>\"Nil\",\"Expenditure on Medical Treatment(Sec-80DDB)\",\"\")","v":{"$error":"#REF!"}},{"$f":"IF(AE249<>\"\",#REF!,\"\")","v":{"$error":"#REF!"}},{"$f":"IF(ROW()-ROW(four)+1>ROWS(three)-COUNTBLANK(three),\"\",INDIRECT(ADDRESS(SMALL((IF(three<>\"\",ROW(three),ROW()+ROWS(three))),ROW()-ROW(four)+1),COLUMN(three),4)))","v":{"$error":"#REF!"}},{"$f":"IF(ROW()-ROW(fouramt)+1>ROWS(threeamt)-COUNTBLANK(threeamt),\"\",INDIRECT(ADDRESS(SMALL((IF(threeamt<>\"\",ROW(threeamt),ROW()+ROWS(threeamt))),ROW()-ROW(fouramt)+1),COLUMN(threeamt),4)))","v":{"$error":"#REF!"}}]
[null,null,null,null,null,null,null,null,null,null,null,null,null,null,null,null,null,null,null,null,null,null,null,null,null,null,null,null,null,null,{"$f":"IF('new statement (2)'!O52<>\"Nil\",\"Interest on Educational Loan (Sec-80 E)\",\"\")","v":"Interest on Educational Loan (Sec-80 E)"},{"$f":"IF(AE250<>\"\",O52,\"\")","v":0},{"$f":"IF(ROW()-ROW(four)+1>ROWS(three)-COUNTBLANK(three),\"\",INDIRECT(ADDRESS(SMALL((IF(three<>\"\",ROW(three),ROW()+ROWS(three))),ROW()-ROW(four)+1),COLUMN(three),4)))","v":{"$error":"#REF!"}},{"$f":"IF(ROW()-ROW(fouramt)+1>ROWS(threeamt)-COUNTBLANK(threeamt),\"\",INDIRECT(ADDRESS(SMALL((IF(threeamt<>\"\",ROW(threeamt),ROW()+ROWS(threeamt))),ROW()-ROW(fouramt)+1),COLUMN(threeamt),4)))","v":{"$error":"#REF!"}}]
[null,null,null,null,null,null,null,null,null,null,null,null,null,null,null,null,null,null,null,null,null,null,null,null,null,null,null,null,null,null,{"$f":"IF('new statement (2)'!O55<>\"Nil\",\"Donation to Charitable Institutions (Sec-80 G)\",\"\")","v":"Donation to Charitable Institutions (Sec-80 G)"},{"$f":"IF(AE251<>\"\",O55,\"\")","v":0},{"$f":"IF(ROW()-ROW(four)+1>ROWS(three)-COUNTBLANK(three),\"\",INDIRECT(ADDRESS(SMALL((IF(three<>\"\",ROW(three),ROW()+ROWS(three))),ROW()-ROW(four)+1),COLUMN(three),4)))","v":{"$error":"#REF!"}},{"$f":"IF(ROW()-ROW(fouramt)+1>ROWS(threeamt)-COUNTBLANK(threeamt),\"\",INDIRECT(ADDRESS(SMALL((IF(threeamt<>\"\",ROW(threeamt),ROW()+ROWS(threeamt))),ROW()-ROW(fouramt)+1),COLUMN(threeamt),4)))","v":{"$error":"#REF!"}}]
[null,null,null,null,null,null,null,null,null,null,null,null,null,null,null,null,null,null,null,null,null,null,null,null,null,null,null,null,null,null,{"$f":"IF('new statement (2)'!#REF!<>\"Nil\",\"Contribution to Political Parties (Sec-80 GGC)\",\"\")","v":{"$error":"#REF!"}},{"$f":"IF(AE252<>\"\",#REF!,\"\")","v":{"$error":"#REF!"}},{"$f":"IF(ROW()-ROW(four)+1>ROWS(three)-COUNTBLANK(three),\"\",INDIRECT(ADDRESS(SMALL((IF(three<>\"\",ROW(three),ROW()+ROWS(three))),ROW()-ROW(four)+1),COLUMN(three),4)))","v":{"$error":"#REF!"}},{"$f":"IF(ROW()-ROW(fouramt)+1>ROWS(threeamt)-COUNTBLANK(threeamt),\"\",INDIRECT(ADDRESS(SMALL((IF(threeamt<>\"\",ROW(threeamt),ROW()+ROWS(threeamt))),ROW()-ROW(fouramt)+1),COLUMN(threeamt),4)))","v":{"$error":"#REF!"}}]
[null,null,null,null,null,null,null,null,null,null,null,null,null,null,null,null,null,null,null,null,null,null,null,null,null,null,null,null,null,null,{"$f":"IF('new statement (2)'!O56<>\"Nil\",\"Deduction for Handicapped Employees (u/s 80U)\",\"\")","v":"Deduction for Handicapped Employees (u/s 80U)"},{"$f":"IF(AE253<>\"\",O56,\"\")","v":0},{"$f":"IF(ROW()-ROW(four)+1>ROWS(three)-COUNTBLANK(three),\"\",INDIRECT(ADDRESS(SMALL((IF(three<>\"\",ROW(three),ROW()+ROWS(three))),ROW()-ROW(four)+1),COLUMN(three),4)))","v":{"$error":"#REF!"}},{"$f":"IF(ROW()-ROW(fouramt)+1>ROWS(threeamt)-COUNTBLANK(threeamt),\"\",INDIRECT(ADDRESS(SMALL((IF(threeamt<>\"\",ROW(threeamt),ROW()+ROWS(threeamt))),ROW()-ROW(fouramt)+1),COLUMN(threeamt),4)))","v":{"$error":"#REF!"}}]
[]
[null,null,null,null,null,null,null,null,null,null,null,null,null,null,null,null,null,null,null,null,null,null,null,null,null,null,null,null,null,null,{"$f":"IF(ISNUMBER(#REF!),\"Income From House Property\",\"\")","v":""},{"$f":"IF(AE255<>\"\",#REF!,\"\")","v":""},{"$f":"IF(ROW()-ROW(six)+1>ROWS(five)-COUNTBLANK(five),\"\",INDIRECT(ADDRESS(SMALL((IF(five<>\"\",ROW(five),ROW()+ROWS(five))),ROW()-ROW(six)+1),COLUMN(five),4)))","v":{"$error":"#REF!"}},{"$f":"IF(ROW()-ROW(sixamt)+1>ROWS(fiveamt)-COUNTBLANK(fiveamt),\"\",INDIRECT(ADDRESS(SMALL((IF(fiveamt<>\"\",ROW(fiveamt),ROW()+ROWS(fiveamt))),ROW()-ROW(sixamt)+1),COLUMN(fiveamt),4)))","v":{"$error":"#REF!"}}]
[null,null,null,null,null,null,null,null,null,null,null,null,null,null,null,null,null,null,null,null,null,null,null,null,null,null,null,null,null,null,{"$f":"IF(#REF!>0,#REF!,\"\")","v":{"$error":"#REF!"}},{"$f":"IF(AE256<>\"\",#REF!,\"\")","v":{"$error":"#REF!"}},{"$f":"IF(ROW()-ROW(six)+1>ROWS(five)-COUNTBLANK(five),\"\",INDIRECT(ADDRESS(SMALL((IF(five<>\"\",ROW(five),ROW()+ROWS(five))),ROW()-ROW(six)+1),COLUMN(five),4)))","v":{"$error":"#REF!"}},{"$f":"IF(ROW()-ROW(sixamt)+1>ROWS(fiveamt)-COUNTBLANK(fiveamt),\"\",INDIRECT(ADDRESS(SMALL((IF(fiveamt<>\"\",ROW(fiveamt),ROW()+ROWS(fiveamt))),ROW()-ROW(sixamt)+1),COLUMN(fiveamt),4)))","v":{"$error":"#REF!"}}]
[null,null,null,null,null,null,null,null,null,null,null,null,null,null,null,null,null,null,null,null,null,null,null,null,null,null,null,null,null,null,{"$f":"IF(#REF!>0,#REF!,\"\")","v":{"$error":"#REF!"}},{"$f":"IF(AE257<>\"\",#REF!,\"\")","v":{"$error":"#REF!"}},{"$f":"IF(ROW()-ROW(six)+1>ROWS(five)-COUNTBLANK(five),\"\",INDIRECT(ADDRESS(SMALL((IF(five<>\"\",ROW(five),ROW()+ROWS(five))),ROW()-ROW(six)+1),COLUMN(five),4)))","v":{"$error":"#REF!"}},{"$f":"IF(ROW()-ROW(sixamt)+1>ROWS(fiveamt)-COUNTBLANK(fiveamt),\"\",INDIRECT(ADDRESS(SMALL((IF(fiveamt<>\"\",ROW(fiveamt),ROW()+ROWS(fiveamt))),ROW()-ROW(sixamt)+1),COLUMN(fiveamt),4)))","v":{"$error":"#REF!"}}]
[null,null,null,null,null,null,null,null,null,null,null,null,null,null,null,null,null,null,null,null,null,null,null,null,null,null,null,null,null,null,{"$f":"IF(#REF!>0,#REF!,\"\")","v":{"$error":"#REF!"}},{"$f":"IF(AE258<>\"\",#REF!,\"\")","v":{"$error":"#REF!"}},{"$f":"IF(ROW()-ROW(six)+1>ROWS(five)-COUNTBLANK(five),\"\",INDIRECT(ADDRESS(SMALL((IF(five<>\"\",ROW(five),ROW()+ROWS(five))),ROW()-ROW(six)+1),COLUMN(five),4)))","v":""},{"$f":"IF(ROW()-ROW(sixamt)+1>ROWS(fiveamt)-COUNTBLANK(fiveamt),\"\",INDIRECT(ADDRESS(SMALL((IF(fiveamt<>\"\",ROW(fiveamt),ROW()+ROWS(fiveamt))),ROW()-ROW(sixamt)+1),COLUMN(fiveamt),4)))","v":""}]
[]
[]
[null,null,null,null,null,null,null,null,null,null,null,null,null,null,null,null,null,null,null,null,null,null,null,null,null,null,null,null,null,null,{"$f":"IF(AND(R66<>\"Nil\",R67<>\"Nil\"),R66-R67,IF(AND(R66>0,R67=\"Nil\"),R66,IF(AND(R67>0,R66=\"Nil\"),(0-R67),\"Nil\")))","v":0}]

{"sheet":"Form 10E NEW REG","index":22,"n_rows":82,"n_cols":17,"rows_kept":82,"cut":false,"hidden":false,"merged":[[81,1,81,2],[81,5,81,7],[82,2,82,3],[30,6,30,7],[58,1,58,7],[59,1,59,7],[77,4,78,4],[77,6,78,7],[79,5,79,7],[80,1,80,2],[80,5,80,7],[45,5,45,7],[46,1,46,2],[46,5,46,7],[47,1,47,2],[47,5,47,7],[54,6,54,9],[36,2,36,6],[36,12,39,17],[37,2,37,6],[38,2,38,6],[39,2,39,6],[43,4,44,4],[35,2,35,6],[22,1,22,2],[22,6,22,7],[23,1,23,2],[23,5,23,7],[27,1,27,9],[28,1,28,9],[29,1,29,9],[31,2,31,6],[32,2,32,6],[33,2,33,6],[34,2,34,6],[21,1,21,7],[10,1,10,4],[10,5,10,7],[11,1,11,7],[12,2,12,6],[13,2,13,6],[14,2,14,6],[15,2,15,6],[16,2,16,7],[18,2,18,7],[19,1,19,7],[20,1,20,7],[5,1,7,4],[5,5,5,6],[6,5,6,7],[7,5,7,7],[8,1,8,4],[8,5,8,7],[4,12,4,16],[0,1,0,7],[1,1,1,7],[2,1,2,7],[3,1,3,7],[4,1,4,7],[0,16,0,22]]}
[{"$f":"F6","v":0}," ചുവടെ Annexure 1 (page 2) statement ല്‍  ക്രമനമ്പര്‍ 8  പ്രകാരം കാണുന്ന തുകയാണ് ഈ വകുപ്പ് പ്രകാരം ഇളവു ലഭിക്കുക. അത് പൂജ്യം ആണെങ്കില്‍ ഇളവുകള്‍ ഒന്നും ലഭിക്കില്ല എന്നര്‍ത്ഥം ",null,null,null,null,null,null,null,null,null,null,null,"Print P-1","Print P- 2","Print P- 3",{"$f":"IF('ARR MONH SPLIT'!AA65=\"Caution ! Your data entry process in this field not completed or there may be errors in typing. Don't click CONTINUE BUTTON below, please check\", \"Warning ! Your data entry in the monthly arrear split up field not completed, or there may be errors. This 10 E statement is not valid\",\"\")","v":""}]
[{"$f":"B3","v":"FORM NO.10 E"},{"$f":"IF('ARREAR SPLIT'!N22>'ARREAR SPLIT'!N5,\"തെറ്റായ രീതിയില്‍ 10 E ഫോം പൂരിപ്പിച്ചതായി കാണുന്നു. 10 E പൂരിപ്പിക്കുന്ന മേഖലയില്‍ എത്തി warning നിര്‍ദ്ദേശങ്ങള്‍ നോക്കുക\",\"\")","v":""}]
[null,"FORM NO.10 E"]
[null,"[See rule 21AA]"]
[null,"Form for furnishing particulars of income under section 192(2A) for the year ending 31 st March, 2022 for claiming relief under section 89(1) by a Government servant or an employee in a Company, Co-operative society, Local authority ,University, Institution, Association or Body.",null,null,null,null,null,null,null,null,null,null,{"$f":"IF('arrear det'!K100>1,\" താങ്കള്‍ manual ആയി ഫോം 10 E തയ്യാറാക്കാനുള്ള ഓപ്ഷന്‍ സ്വീകരിച്ചതിനാല്‍ ഈ കാണുന്ന പ്രിന്‍റ് ഉപയോഗിക്കരുത് പകരം സ്വയം തയ്യാറാക്കിയ പ്രിന്‍റ് ഉപയോഗിക്കുക \",M37)","v":"താങ്കള്‍ക്കു ഈ വകുപ്പ് പ്രകാരം നികുതി ഇളവു കാണുന്നില്ല, അതിനാല്‍ Form 10 E set തയ്യാറാക്കേണ്ടതില്ല."}]
[null,"Name and address of the employee:",null,null,null,{"$f":"PERSONAL!H4","v":0},null,{"$f":"PERSONAL!H5","v":"Below 60 Years"},"CUSAT, CUCEK, PULINCUNNOO - 688504"]
[null,null,null,null,null,{"$f":"PERSONAL!H6","v":0}]
[null,null,null,null,null,{"$f":"CUSTOMISE!H22","v":0}]
[null,"Permanent Account Number (PAN)",null,null,null,{"$f":"PERSONAL!H7","v":0},null,null,"Third","March",2009]
[]
[null,"Residential status",null,null,null,"RESIDENT AND ORDINARILY RESIDENT",null,null,"Fourth","April"]
[null,"Particulars of income referred to in rule 21A of the Income-tax Rules, 1962,during the previous year relevant to assessment year 2022-23(Rs.)",null,null,null,null,null,null,"Fifth","May"]
[null,"1 (a)","Salary received in arrears or in advance in accordance with the provisions of sub-rule (2) of rule 21A.",null,null,null,null,{"$f":"H34","v":0},"Sixth","June"]
[null,"(b)","Payment in the nature of gratuity in respect of past services, extending over a period of not less than 5 years in accordance with the provisions of sub-rule (3) of rule 21A.",null,null,null,null,"…Nil…","Seventh","July"]
[null,"(c)","Payment in the nature of compensation from the employer or former employer at or in connection with termination of employment after continuous service of not less than 3 years or where the unexpired portion of term of employment is also not less than 3 years",null,null,null,null,"…Nil…","Eighth","August"]
[null,"(d)","Payment in commutation of pension in accordance with the provisions of sub-rule (5) of rule 21A",null,null,null,null,"…Nil…","Ninth","September"]
[null,2,"Detailed particulars of payments referred to above may be given in Annexure I,II,IIA,III, or IV as the case may be.",null,null,null,null,null,"Eleventh","November"]
[null,null,null,null,null,null,null,null,"Twelfth","November"]
[null,null,{"$f":"(\" Signature of  \"&F6)","v":" Signature of  0"},null,null,null,null,null,"Thriteenth","December"]
[null,"Verification",null,null,null,null,null,null,"Fourteenth"]
[null,{"$f":"\"I, \"&F6&\",  \"&F7&\", \"&F8&\", \"&M21","v":"I, 0,  0, 0, do hereby declare that what is stated above is true to the best of my knowledge and belief."},null,null,null,null,null,null,"Fifteenth",null,null,null,"do hereby declare that what is stated above is true to the best of my knowledge and belief."]
[null,{"$f":"\"Verified today on the, \"&DAY(TODAY())&VLOOKUP(DAY(TODAY()),data,2,FALSE) &\" day of  \"& VLOOKUP(MONTH(TODAY()),data,3,FALSE)&\"  \"& YEAR(TODAY())","v":"Verified today on the, 5th day of  February  2024"}]
[null,{"$f":"B47","v":0},null,null,null,null,null,null,"Twentieth"]
[null,{"$f":"B48","v":"05/02/2024"},null,null,null,{"$f":"C19","v":" Signature of  0"},null,null,"Twenty first"]
[null,null,null,null,null,null,null,null,"Twenty second"]
[null,null,null,null,null,null,null,null,"Twenty third"]
[null,null,null,null,null,null,null,null,"Twenty fourth"]
[null,"ANNEXURE-I"]
[null,"[See item 2 of Form No.10E]"]
[null,"Arrears or advance salary"]
[null,null,null,null,null,null,"NEW REGIME",null,"Twenty eighth"]
[null,"Sl.No","PARTICULARS",null,null,null,null,"Amount (Rs)"]
[null,1,"Total income (excluding salary received in arrears or advance)",null,null,null,null,{"$f":"IF('ARREAR SPLIT'!N5=0,0,'new statement (2)'!R59-'ARREAR SPLIT'!N5+'ARREAR SPLIT'!N23)","v":0}]
[null,2,"Salary received in arrears or advance",null,null,null,null,{"$f":"IF('ARREAR SPLIT'!K5=0,0,Data!R35)","v":0}]
[null,3,"Total income (as increased by salary received in arrears or advance) [Add item 1 and item 2]",null,null,null,null,{"$f":"SUM(H33:H34)","v":0}]
[null,4,"Tax on total income [as per item 3]",null,null,null,null,{"$f":"IF('ARREAR SPLIT'!N5=0,0,' Form 16 NEW REGIME'!J85)","v":0}]
[null,5,"Tax on total income [as per item 1]",null,null,null,null,{"$f":"IF('ARREAR SPLIT'!N5=0,0,' Form 16 NEW REGIME'!N116)","v":0},null,null,null,null,{"$f":"IF('arrear det'!K100>1,\" താങ്കള്‍ manual ആയി ഫോം 10 E തയ്യാറാക്കാനുള്ള ഓപ്ഷന്‍ സ്വീകരിച്ചതിനാല്‍ ഈ കാണുന്ന പ്രിന്‍റ് ഉപയോഗിക്കരുത് പകരം സ്വയം തയ്യാറാക്കിയ പ്രിന്‍റ് ഉപയോഗിക്കുക \",IF(H40<1,\"താങ്കള്‍ക്കു ഈ വകുപ്പ് പ്രകാരം നികുതി ഇളവു കാണുന്നില്ല, അതിനാല്‍ Form 10 E set തയ്യാറാക്കേണ്ടതില്ല.\",\"ഇടതു വശത്തു 8  നമ്പറിനു നേരെ കാണുന്ന തുക Rs.  \"&ROUND(H40,0)&\", യാണ് ഇളവായി ലഭിക്കുക. അത് Atomatic ആയി statement ല്‍ രേഖപ്പെടുത്തും. താങ്കള്‍ ഒന്നും ചെയ്യേണ്ടതില്ല. മുകളിൽ കാണുന്ന പ്രിന്റിങ് ബട്ടൺ ഉപയോഗിച്ച് 3 പേജുള്ള പ്രിൻറ് എടുക്കുക ആ രേഖ Income  tax  Statement  ഒപ്പം സമർപ്പിക്കേണ്ടതാണ് \"))","v":"താങ്കള്‍ക്കു ഈ വകുപ്പ് പ്രകാരം നികുതി ഇളവു കാണുന്നില്ല, അതിനാല്‍ Form 10 E set തയ്യാറാക്കേണ്ടതില്ല."}]
[null,6,"Tax on salary received in arrears or advance [Difference of item 4 and item 5]",null,null,null,null,{"$f":"SUM(H36-H37)","v":0}]
[null,7,"Tax computed in accordance with Table \"A\" [Brought from column 7 of Table A]",null,null,null,null,{"$f":"'Form 10E NEW REG'!H76","v":0}]
[null,8,"Relief under Section 89(1) [Indicate difference between the amounts mentioned against item 6 and item 7]",null,null,null,null,{"$f":"IF(SUM(H38-H39)<1,0,SUM(H38-H39))","v":0}]
[]
[]
[]
[null,null,null,null,"Signature:"]
[]
[null,null,null,null,"Name:",{"$f":"F6","v":0}]
[null,{"$f":"CUSTOMISE!H23","v":0},null,null,"Designation",{"$f":"F7","v":0}]
[null,{"$f":"TEXT(TODAY(),\"dd/mm/yyyy\")","v":"05/02/2024"},null,null,"Office",{"$f":"F8","v":0}]
[]
[]
[]
[]
[]
[]
[null,null,null,null,null,null,"babuvadukkumchery.blogspot.com"]
[]
[]
[]
[null,"TABLE- A"]
[null,"[See item 7 of Annexure 1]"]
[]
[null,"Previous year","Total income of the relevent previous year(Rs.)","Salary received in arrears or advance relating to the relevent previous year as mentioned in column (1) (Rs.)","Total income (as increased by salary received in arrears or advance) of the relevent previous year mentioned in column (1) (Rs.)","Tax on total income [as per column (2)-After Rebate and including Edn Cess and Surcharge] (Rs.)","Tax on total income[as per column (4) After Rebate and including Edn Cess and Surcharge] (Rs.)","Difference in tax [Amount under column (6) minus amount under column  (5)] (Rs.)"]
[null,"(1)","(2)","(3)","(4)","(5)","(6)","(7)"]
[null,"2009-10",{"$f":"Data!Q14","v":0},{"$f":"Data!Q15","v":0},{"$f":"IF(Data!Q36>0,Data!Q36,0)","v":0},{"$f":"Data!Q29","v":0},{"$f":"Data!Q41","v":0},{"$f":"G64-F64","v":0}]
[null,"2010-11",{"$f":"Data!P14","v":0},{"$f":"Data!P15","v":0},{"$f":"IF(Data!P36>0,Data!P36,0)","v":0},{"$f":"Data!P29","v":0},{"$f":"Data!P41","v":0},0]
[null,"2011-12",{"$f":"Data!O14","v":0},{"$f":"Data!O15","v":0},{"$f":"IF(Data!O36>0,Data!O36,0)","v":0},{"$f":"Data!O29","v":0},{"$f":"Data!O41","v":0},0]
[null,"2012-13",{"$f":"Data!N14","v":0},{"$f":"Data!N15","v":0},{"$f":"IF(Data!N36>0,Data!N36,0)","v":0},{"$f":"Data!N29","v":0},{"$f":"Data!N41","v":0},0]
[null,"2013-14",{"$f":"Data!M14","v":0},{"$f":"Data!M15","v":0},{"$f":"IF(Data!M36>0,Data!M36,0)","v":0},{"$f":"Data!M29","v":0},{"$f":"Data!M41","v":0},0]
[null,"2014-15",{"$f":"Data!L14","v":0},{"$f":"Data!L15","v":0},{"$f":"IF(Data!L36>0,Data!L36,0)","v":0},{"$f":"Data!L29","v":0},{"$f":"Data!L41","v":0},0]
[null,"2015-16",{"$f":"Data!K14","v":0},{"$f":"Data!K15","v":0},{"$f":"IF(Data!K36>0,Data!K36,0)","v":0},{"$f":"Data!K29","v":0},{"$f":"Data!K41","v":0},{"$f":"G70-F70","v":0}]
[null,"2016-17",{"$f":"Data!J14","v":0},{"$f":"Data!J15","v":0},{"$f":"IF(Data!J36>0,Data!J36,0)","v":0},{"$f":"Data!J29","v":0},{"$f":"Data!J41","v":0},0]
[null,"2017-18",{"$f":"Data!I14","v":0},{"$f":"Data!I15","v":0},{"$f":"IF(Data!I36>0,Data!I36,0)","v":0},{"$f":"Data!I29","v":0},{"$f":"Data!I41","v":0},0]
[null,"2018-19",{"$f":"Data!H14","v":0},{"$f":"Data!H15","v":0},{"$f":"IF(Data!H36>0,Data!H36,0)","v":0},{"$f":"Data!H29","v":0},{"$f":"Data!H41","v":0},0]
[null,"2019-20",{"$f":"Data!G14","v":0},{"$f":"Data!G15","v":0},{"$f":"IF(Data!G36>0,Data!G36,0)","v":0},{"$f":"Data!G29","v":0},{"$f":"Data!G41","v":0},0]
[null,{"$f":"\"2020-21 \"&'ARREAR SPLIT'!M29&\" option selected\"","v":"2020-21 OLD REGIME option selected"},{"$f":"Data!F14","v":0},{"$f":"Data!F15","v":0},{"$f":"IF(Data!F36>0,Data!F36,0)","v":0},{"$f":"IF(M75=\"OLD REGIME\",Data!F29,Data!T29)","v":0},{"$f":"IF(M75=\"OLD REGIME\",Data!F41,Data!T41)","v":0},0,null,null,null,null,{"$f":"'ARREAR SPLIT'!M29","v":"OLD REGIME"}]
[null,"Total",{"$f":"SUM(C64:C75)","v":0},0,0,0,0,0]
[]
[null,null,null,null,"Signature:"]
[]
[null,null,null,null,"Name:",{"$f":"F46","v":0}]
[null,{"$f":"B47","v":0},null,null,"Designation:",{"$f":"F47","v":0}]
[null,{"$f":"B48","v":"05/02/2024"},null,null,"Dept:",{"$f":"F48","v":0}]

{"sheet":"Form 10E","index":23,"n_rows":82,"n_cols":16,"rows_kept":82,"cut":false,"hidden":false,"merged":[[39,2,39,6],[36,12,39,17],[16,2,16,7],[38,2,38,6],[31,2,31,6],[23,1,23,2],[32,2,32,6],[37,2,37,6],[19,1,19,7],[20,1,20,7],[22,1,22,2],[22,6,22,7],[0,1,0,7],[1,1,1,7],[4,12,4,16],[21,1,21,7],[18,2,18,7],[14,2,14,6],[10,1,10,4],[10,5,10,7],[12,2,12,6],[11,1,11,7],[15,2,15,6],[2,1,2,7],[7,5,7,7],[8,1,8,4],[5,5,5,6],[5,1,7,4],[4,1,4,7],[8,5,8,7],[13,2,13,6],[82,2,82,3],[77,4,78,4],[77,6,78,7],[79,5,79,7],[80,5,80,7],[81,1,81,2],[59,1,59,7],[47,1,47,2],[46,1,46,2],[81,5,81,7],[54,6,54,9],[80,1,80,2],[58,1,58,7],[0,15,0,20],[23,5,23,7],[45,5,45,7],[46,5,46,7],[47,5,47,7],[27,1,27,9],[43,4,44,4],[33,2,33,6],[34,2,34,6],[35,2,35,6],[28,1,28,9],[29,1,29,9],[36,2,36,6],[30,6,30,7],[3,1,3,7],[6,5,6,7]]}
[{"$f":"F6","v":0}," ചുവടെ Annexure 1 (page 2) statement ല്‍  ക്രമനമ്പര്‍ 8  പ്രകാരം കാണുന്ന തുകയാണ് ഈ വകുപ്പ് പ്രകാരം ഇളവു ലഭിക്കുക. അത് പൂജ്യം ആണെങ്കില്‍ ഇളവുകള്‍ ഒന്നും ലഭിക്കില്ല എന്നര്‍ത്ഥം ",null,null,null,null,null,null,null,null,null,null,"Print P-1","Print P-2","Print P-3",{"$f":"IF('ARR MONH SPLIT'!AA65=\"Caution ! Your data entry process in this field not completed or there may be errors in typing. Don't click CONTINUE BUTTON below, please check\", \"Warning ! Your data entry in the monthly arrear split up field not completed, or there may be errors in that statement. This 10 E statement is not valid\",\"\")","v":""}]
[{"$f":"B3","v":"FORM NO.10 E"},{"$f":"IF('ARREAR SPLIT'!N22>'ARREAR SPLIT'!N5,\"തെറ്റായ രീതിയില്‍ 10 E ഫോം പൂരിപ്പിച്ചതായി കാണുന്നു. 10 E പൂരിപ്പിക്കുന്ന മേഖലയില്‍ എത്തി warning നിര്‍ദ്ദേശങ്ങള്‍ നോക്കുക\",\"\")","v":""}]
[null,"FORM NO.10 E"]
[null,"[See rule 21AA]"]
[null,"Form for furnishing particulars of income under section 192(2A) for the year ending 31 st March, 2022 for claiming relief under section 89(1) by a Government servant or an employee in a Company, Co-operative society, Local authority ,University, Institution, Association or Body.",null,null,null,null,null,null,null,null,null,null,{"$f":"IF('arrear det'!K100>1,\" താങ്കള്‍ manual ആയി ഫോം 10 E തയ്യാറാക്കാനുള്ള ഓപ്ഷന്‍ സ്വീകരിച്ചതിനാല്‍ ഈ കാണുന്ന പ്രിന്‍റ് ഉപയോഗിക്കരുത് പകരം സ്വയം തയ്യാറാക്കിയ പ്രിന്‍റ് ഉപയോഗിക്കുക \",M37)","v":"താങ്കള്‍ക്കു ഈ വകുപ്പ് പ്രകാരം നികുതി ഇളവു കാണുന്നില്ല, അതിനാല്‍ Form 10 E set തയ്യാറാക്കേണ്ടതില്ല."}]
[null,"Name and address of the employee:",null,null,null,{"$f":"PERSONAL!H4","v":0},null,{"$f":"PERSONAL!H5","v":"Below 60 Years"},"CUSAT, CUCEK, PULINCUNNOO - 688504"]
[null,null,null,null,null,{"$f":"PERSONAL!H6","v":0}]
[null,null,null,null,null,{"$f":"CUSTOMISE!H22","v":0}]
[null,"Permanent Account Number (PAN)",null,null,null,{"$f":"PERSONAL!H7","v":0},null,null,"Third","March",2009]
[]
[null,"Residential status",null,null,null,"RESIDENT AND ORDINARILY RESIDENT",null,null,"Fourth","April"]
[null,"Particulars of income referred to in rule 21A of the Income-tax Rules, 1962,during the previous year relevant to assessment year 2022-23(Rs.)",null,null,null,null,null,null,"Fifth","May"]
[null,"1 (a)","Salary received in arrears or in advance in accordance with the provisions of sub-rule (2) of rule 21A.",null,null,null,null,{"$f":"H34","v":0},"Sixth","June"]
[null,"(b)","Payment in the nature of gratuity in respect of past services, extending over a period of not less than 5 years in accordance with the provisions of sub-rule (3) of rule 21A.",null,null,null,null,"…Nil…","Seventh","July"]
[null,"(c)","Payment in the nature of compensation from the employer or former employer at or in connection with termination of employment after continuous service of not less than 3 years or where the unexpired portion of term of employment is also not less than 3 years",null,null,null,null,"…Nil…","Eighth","August"]
[null,"(d)","Payment in commutation of pension in accordance with the provisions of sub-rule (5) of rule 21A",null,null,null,null,"…Nil…","Ninth","September"]
[null,2,"Detailed particulars of payments referred to above may be given in Annexure I,II,IIA,III, or IV as the case may be.",null,null,null,null,null,"Eleventh","November"]
[null,null,null,null,null,null,null,null,"Twelfth","November"]
[null,null,{"$f":"(\" Signature of  \"&F6)","v":" Signature of  0"},null,null,null,null,null,"Thriteenth","December"]
[null,"Verification",null,null,null,null,null,null,"Fourteenth"]
[null,{"$f":"\"I, \"&F6&\",  \"&F7&\", \"&F8&\", \"&M21","v":"I, 0,  0, 0, do hereby declare that what is stated above is true to the best of my knowledge and belief."},null,null,null,null,null,null,"Fifteenth",null,null,null,"do hereby declare that what is stated above is true to the best of my knowledge and belief."]
[null,{"$f":"\"Verified today on the, \"&DAY(TODAY())&VLOOKUP(DAY(TODAY()),data,2,FALSE) &\" day of  \"& VLOOKUP(MONTH(TODAY()),data,3,FALSE)&\"  \"& YEAR(TODAY())","v":"Verified today on the, 5th day of  February  2024"}]
[null,{"$f":"B47","v":0},null,null,null,null,null,null,"Twentieth"]
[null,{"$f":"B48","v":"05/02/2024"},null,null,null,{"$f":"C19","v":" Signature of  0"},null,null,"Twenty first"]
[null,null,null,null,null,null,null,null,"Twenty second"]
[null,null,null,null,null,null,null,null,"Twenty third"]
[null,null,null,null,null,null,null,null,"Twenty fourth"]
[null,"ANNEXURE-I"]
[null,"[See item 2 of Form No.10E]"]
[null,"Arrears or advance salary"]
[null,null,null,null,null,null,"OLD REGIME",null,"Twenty eighth"]
[null,"Sl.No","PARTICULARS",null,null,null,null,"Amount (Rs)"]
[null,1,"Total income (excluding salary received in arrears or advance)",null,null,null,null,{"$f":"IF('ARREAR SPLIT'!N5=0,0,'new statement'!R59-'ARREAR SPLIT'!N5+'ARREAR SPLIT'!N23)","v":0}]
[null,2,"Salary received in arrears or advance",null,null,null,null,{"$f":"IF('ARREAR SPLIT'!K5=0,0,Data!R35)","v":0}]
[null,3,"Total income (as increased by salary received in arrears or advance) [Add item 1 and item 2]",null,null,null,null,{"$f":"SUM(H33:H34)","v":0}]
[null,4,"Tax on total income [as per item 3]",null,null,null,null,{"$f":"IF('ARREAR SPLIT'!N5=0,0,ROUND((Data!E29),0))","v":0}]
[null,5,"Tax on total income [as per item 1]",null,null,null,null,{"$f":"IF('ARREAR SPLIT'!N5=0,0,ROUND((Data!E41),0))","v":0},null,null,null,null,{"$f":"IF('arrear det'!K100>1,\" താങ്കള്‍ manual ആയി ഫോം 10 E തയ്യാറാക്കാനുള്ള ഓപ്ഷന്‍ സ്വീകരിച്ചതിനാല്‍ ഈ കാണുന്ന പ്രിന്‍റ് ഉപയോഗിക്കരുത് പകരം സ്വയം തയ്യാറാക്കിയ പ്രിന്‍റ് ഉപയോഗിക്കുക \",IF(H40<1,\"താങ്കള്‍ക്കു ഈ വകുപ്പ് പ്രകാരം നികുതി ഇളവു കാണുന്നില്ല, അതിനാല്‍ Form 10 E set തയ്യാറാക്കേണ്ടതില്ല.\",\"ഇടതു വശത്തു 8  നമ്പറിനു നേരെ കാണുന്ന തുക Rs.  \"&ROUND(H40,0)&\", യാണ് ഇളവായി ലഭിക്കുക. അത് Atomatic ആയി statement ല്‍ രേഖപ്പെടുത്തും. താങ്കള്‍ ഒന്നും ചെയ്യേണ്ടതില്ല  മുകളിൽ കാണുന്ന പ്രിന്റിങ് ബട്ടൺ ഉപയോഗിച്ച് 3 പേജുള്ള പ്രിൻറ് എടുക്കുക ആ രേഖ Income  tax  Statement  ഒപ്പം സമർപ്പിക്കേണ്ടതാണ്\"))","v":"താങ്കള്‍ക്കു ഈ വകുപ്പ് പ്രകാരം നികുതി ഇളവു കാണുന്നില്ല, അതിനാല്‍ Form 10 E set തയ്യാറാക്കേണ്ടതില്ല."}]
[null,6,"Tax on salary received in arrears or advance [Difference of item 4 and item 5]",null,null,null,null,{"$f":"SUM(H36-H37)","v":0}]
[null,7,"Tax computed in accordance with Table \"A\" [Brought from column 7 of Table A]",null,null,null,null,{"$f":"'Form 10E'!H76","v":0}]
[null,8,"Relief under Section 89(1) [Indicate difference between the amounts mentioned against item 6 and item 7]",null,null,null,null,{"$f":"IF(SUM(H38-H39)<1,0,SUM(H38-H39))","v":0}]
[]
[]
[]
[null,null,null,null,"Signature:"]
[]
[null,null,null,null,"Name:",{"$f":"F6","v":0}]
[null,{"$f":"CUSTOMISE!H23","v":0},null,null,"Designation",{"$f":"F7","v":0}]
[null,{"$f":"TEXT(TODAY(),\"dd/mm/yyyy\")","v":"05/02/2024"},null,null,"Office",{"$f":"F8","v":0}]
[]
[]
[]
[]
[]
[]
[null,null,null,null,null,null,"babuvadukkumchery.blogspot.com"]
[]
[]
[]
[null,"TABLE- A"]
[null,"[See item 7 of Annexure 1]"]
[]
[null,"Previous year","Total income of the relevent previous year(Rs.)","Salary received in arrears or advance relating to the relevent previous year as mentioned in column (1) (Rs.)","Total income (as increased by salary received in arrears or advance) of the relevent previous year mentioned in column (1) (Rs.)","Tax on total income [as per column (2)-After Rebate and including Edn Cess and Surcharge] (Rs.)","Tax on total income[as per column (4) After Rebate and including Edn Cess and Surcharge] (Rs.)","Difference in tax [Amount under column (6) minus amount under column  (5)] (Rs.)"]
[null,"(1)","(2)","(3)","(4)","(5)","(6)","(7)"]
[null,"2009-10",{"$f":"Data!Q14","v":0},{"$f":"Data!Q15","v":0},{"$f":"IF(Data!Q36>0,Data!Q36,0)","v":0},{"$f":"Data!Q29","v":0},{"$f":"Data!Q41","v":0},{"$f":"G64-F64","v":0}]
[null,"2010-11",{"$f":"Data!P14","v":0},{"$f":"Data!P15","v":0},{"$f":"IF(Data!P36>0,Data!P36,0)","v":0},{"$f":"Data!P29","v":0},{"$f":"Data!P41","v":0},0]
[null,"2011-12",{"$f":"Data!O14","v":0},{"$f":"Data!O15","v":0},{"$f":"IF(Data!O36>0,Data!O36,0)","v":0},{"$f":"Data!O29","v":0},{"$f":"Data!O41","v":0},0]
[null,"2012-13",{"$f":"Data!N14","v":0},{"$f":"Data!N15","v":0},{"$f":"IF(Data!N36>0,Data!N36,0)","v":0},{"$f":"Data!N29","v":0},{"$f":"Data!N41","v":0},0]
[null,"2013-14",{"$f":"Data!M14","v":0},{"$f":"Data!M15","v":0},{"$f":"IF(Data!M36>0,Data!M36,0)","v":0},{"$f":"Data!M29","v":0},{"$f":"Data!M41","v":0},0]
[null,"2014-15",{"$f":"Data!L14","v":0},{"$f":"Data!L15","v":0},{"$f":"IF(Data!L36>0,Data!L36,0)","v":0},{"$f":"Data!L29","v":0},{"$f":"Data!L41","v":0},0]
[null,"2015-16",{"$f":"Data!K14","v":0},{"$f":"Data!K15","v":0},{"$f":"IF(Data!K36>0,Data!K36,0)","v":0},{"$f":"Data!K29","v":0},{"$f":"Data!K41","v":0},{"$f":"G70-F70","v":0}]
[null,"2016-17",{"$f":"Data!J14","v":0},{"$f":"Data!J15","v":0},{"$f":"IF(Data!J36>0,Data!J36,0)","v":0},{"$f":"Data!J29","v":0},{"$f":"Data!J41","v":0},{"$f":"G71-F71","v":0}]
[null,"2017-18",{"$f":"Data!I14","v":0},{"$f":"Data!I15","v":0},{"$f":"IF(Data!I36>0,Data!I36,0)","v":0},{"$f":"Data!I29","v":0},{"$f":"Data!I41","v":0},{"$f":"G72-F72","v":0}]
[null,"2018-19",{"$f":"Data!H14","v":0},{"$f":"Data!H15","v":0},{"$f":"IF(Data!H36>0,Data!H36,0)","v":0},{"$f":"Data!H29","v":0},{"$f":"Data!H41","v":0},{"$f":"G73-F73","v":0}]
[null,"2019-20",{"$f":"Data!G14","v":0},{"$f":"Data!G15","v":0},{"$f":"IF(Data!G36>0,Data!G36,0)","v":0},{"$f":"Data!G29","v":0},{"$f":"Data!G41","v":0},{"$f":"G74-F74","v":0}]
[null,{"$f":"\"2020-21 \"&'ARREAR SPLIT'!M29&\" option selected\"","v":"2020-21 OLD REGIME option selected"},{"$f":"'Form 10E NEW REG'!C75","v":0},{"$f":"'Form 10E NEW REG'!D75","v":0},{"$f":"'Form 10E NEW REG'!E75","v":0},{"$f":"'Form 10E NEW REG'!F75","v":0},{"$f":"'Form 10E NEW REG'!G75","v":0},{"$f":"'Form 10E NEW REG'!H75","v":0}]
[null,"Total",{"$f":"SUM(C64:C75)","v":0},0,0,0,0,0]
[]
[null,null,null,null,"Signature:"]
[]
[null,null,null,null,"Name:",{"$f":"F46","v":0}]
[null,{"$f":"B47","v":0},null,null,"Designation:",{"$f":"F47","v":0}]
[null,{"$f":"B48","v":"05/02/2024"},null,null,"Dept:",{"$f":"F48","v":0}]

{"sheet":"arrear det","index":24,"n_rows":103,"n_cols":16,"rows_kept":103,"cut":false,"hidden":false,"merged":[[2,11,2,12],[5,1,5,9],[8,10,9,10],[5,10,7,10],[1,1,1,10],[16,11,18,13],[32,1,33,10],[29,11,30,11],[32,11,33,12],[29,1,30,10],[31,4,31,10],[17,3,17,9],[18,3,18,10],[19,3,19,10],[22,3,22,10],[25,3,25,10],[14,1,15,1],[0,4,0,10],[8,1,8,9],[3,5,3,10],[6,1,7,9],[9,1,9,9],[13,3,13,10],[2,3,2,10],[12,3,12,9],[97,4,97,10],[98,4,98,9],[102,4,102,10],[99,4,99,9],[101,4,101,10]]}
[null,null,null,null,{"$f":"PERSONAL!H4&\"- FORM 10-E PREPARATION FIELD\"","v":"- FORM 10-E PREPARATION FIELD"},null,null,null,null,null,null,"Scroll mouse up and down "]
[null,"Caution...!  Just place mouse pointer on this lines to read an important warning.  തുടരുന്നതിന് മുന്‍പായി ഈ വരികളില്‍ മൗസ് പൊയിന്‍റെര്‍ വച്ച് നിര്‍ദ്ദേശങ്ങള്‍ വായിക്കുക ",null,null,null,null,null,null,null,null,null,null,null,null,"Male"]
[null,null,null,{"$f":"\"Dear \"&PERSONAL!H4&\", Please select your category from options once again-താങ്കള്‍ പുരുഷനാണോ സ്ത്രീയാണോ Senior Citizen വിഭാഗത്തില്‍പെടുന്നവനാണോ ?  വലതു വശത്തെ ഓപ്ഷനില്‍ നിന്നും തിരഞ്ഞെടുക്കുക \"","v":"Dear , Please select your category from options once again-താങ്കള്‍ പുരുഷനാണോ സ്ത്രീയാണോ Senior Citizen വിഭാഗത്തില്‍പെടുന്നവനാണോ ?  വലതു വശത്തെ ഓപ്ഷനില്‍ നിന്നും തിരഞ്ഞെടുക്കുക "},null,null,null,null,null,null,null,{"$f":"'ARREAR SPLIT'!O35","v":"Male"},null,null,"Female"]
[null,null,null,null,null,"താങ്കള്‍ പുരുഷനാണോ സ്ത്രീയാണോ Senior Citizen വിഭാഗത്തില്‍പെടുന്നവനാണോ ?  വലതു വശത്തെ ഓപ്ഷനില്‍ നിന്നും തിരഞ്ഞെടുക്കുക ",null,null,null,null,null,null,null,null,"Senior Citizen (65-79)"]
[1,null,null,"Arrears Credited to PROVIDENT FUND including interest (Total) [  PF ല്‍ ചേര്‍ത്ത കുടിശ്ശിക ] ",null,null,null,null,null,null,{"$f":"'det.sal input'!L21","v":0},null,null,null,"Senior Citizen (above 80)"]
[1,"Taxable Income of current year- 2016-17(including all arrears received during current year)",null,null,null,null,null,null,null,null,{"$f":"'new statement'!R59","v":0}]
[null,"To find out that amount, see point No. 12 in Income tax statement printout prepared with ECTAX 2014). നടപ്പ് വര്‍ഷത്തില്‍ കിട്ടിയ പല വിധ കാലഘട്ടങ്ങളിലെതടക്കമുള്ള തുകയില്‍ നിന്നും ProfessionTax, Chapter VI A deduction എന്നിവ കുറച്ചതിനു ശേഷമുള്ള തുകയാണിത്,  എന്നാല്‍ 2 Lakh എന്ന നികുതിവിധേയമല്ലാത്ത തുക കുറക്കുന്നതിനു തൊട്ടു മുന്‍പുള്ളതും . "]
[]
[2,"Arrears received in the current year -2014-15 (received during 1-4-2014 to 31-3-2015)",null,null,null,null,null,null,null,null,{"$f":"'new statement'!L92+'new statement'!L93-K13","v":0}]
[null,"Including Pay revision arrear and DA arrear, received in this year, relating to the previous period and current period. That is all arrear amounts over normal salary received during the current year (നടപ്പ് വര്‍ഷത്തില്‍ സാധാരണ ശമ്പളത്തിന് പുറമേ കിട്ടിയ 2013-14 വര്‍ഷത്തിലേക്ക് ബാധകമായതും അതിനു മുന്‍ വര്‍ഷങ്ങളിലേക്ക് ബാധകമായതും ആയ തുകകള്‍  ഇതില്‍ ഉള്‍പ്പെടുന്നു. ) "]
[2,null,null,"Arrears Received as CASH/ Credited to NPS  (Total) [ പണമായി വാങ്ങിയ കുടിശ്ശിക/ NPS ല്‍ ചേര്‍ത്തത്  ]",null,null,null,null,null,null,{"$f":"'det.sal input'!L22","v":0},"Allocate the sub divided value of the above amount  Rs"]
[3,null,null,"Total of arrears earned during the year [ അതായത് മൊത്തം നേടിയത് ]",null,null,null,null,null,null,{"$f":"K5+K11","v":0},"to the concerned years, in  which it is related with "]
[4,null,null,{"$f":"\"Interest porion of pay revision arrear  on the above amount \"&K12&\" (മേല്‍ കാണിച്ച തുകയില്‍ ഉള്‍പ്പെട്ടിട്ടുള്ള പലിശ തുക) \"","v":"Interest porion of pay revision arrear  on the above amount 0 (മേല്‍ കാണിച്ച തുകയില്‍ ഉള്‍പ്പെട്ടിട്ടുള്ള പലിശ തുക) "},null,null,null,null,null,null,{"$f":"'det.sal input'!W27","v":0},{"$f":"\"4 a) arrear excluding interest is \"&K12-K13","v":"4 a) arrear excluding interest is 0"}]
[null,null,null,{"$f":"\"Divide the total arrear excluding interest Rs \"&K12-K13&\" and distribute it to concerned years. മൊത്തം നേടിയ പലിശരഹിത കുടിശ്ശിക തുകയെ (No. 4 a ) വിഭജിച്ച്‌ അതതു വര്‍ഷങ്ങളുടെ കീഴില്‍ എഴുതുക 2017-18 ലെ എഴുതേണ്ടതില്ല\"&\" DISTRIBUTION OF ARREAR TO DIFFERENT FINANCIAL YEARS (EXCLUDING INTEREST)\"","v":"Divide the total arrear excluding interest Rs 0 and distribute it to concerned years. മൊത്തം നേടിയ പലിശരഹിത കുടിശ്ശിക തുകയെ (No. 4 a ) വിഭജിച്ച്‌ അതതു വര്‍ഷങ്ങളുടെ കീഴില്‍ എഴുതുക 2017-18 ലെ എഴുതേണ്ടതില്ല DISTRIBUTION OF ARREAR TO DIFFERENT FINANCIAL YEARS (EXCLUDING INTEREST)"}]
[null,{"$f":"(\"Subdivision of Rs.  \"&K9)","v":"Subdivision of Rs.  0"},"2017-18","2016-17","2015-16","2014-15 Rs","2013-14 Rs","2012-13 Rs","2011-12 Rs","2010-11 Rs","2009-10 Rs",{"$f":"F16+G16+H16+I16+J16+K16","v":0}]
[5,null,{"$f":"'ARREAR SPLIT'!C77","v":1000},{"$f":"'ARREAR SPLIT'!D77","v":3000},{"$f":"'ARREAR SPLIT'!E77","v":0},{"$f":"'ARREAR SPLIT'!F77","v":0},{"$f":"'ARREAR SPLIT'!G77","v":0},{"$f":"'ARREAR SPLIT'!H77","v":0},{"$f":"'ARREAR SPLIT'!I77","v":0},{"$f":"'ARREAR SPLIT'!J77","v":0},{"$f":"'ARREAR SPLIT'!K77","v":0},{"$f":"IF(K18<0,\" Error, the amount of arrear distributed here is not correct\",\"\")","v":" Error, the amount of arrear distributed here is not correct"}]
[]
[null,"Arrear portion relating to 2014-15 automatically generated is equel to Rs.",null,"Automatically estimated Arrear amount relating to 2017-18 year is Rs.",null,null,null,null,null,null,{"$f":"K12-K13-SUM(D16:K16)-'ARREAR SPLIT'!C77","v":-4000},null,null,null,null,"Male"]
[null,null,null,"Show TAXABLE INCOME (TOTAL INCOME) of previous years in respective fields "]
[null,null,null,"What is Taxable Income of previous year..?  You must read it. Just place mouse pointer on this lines and read. പിന്‍കാല ടാക്സബിള്‍ ഇന്‍കം എന്നാല്‍ എന്ത്...? ഈ വരികളില്‍ മൗസ് പൊയിന്‍റെര്‍ വച്ച് നിര്‍ബന്ധമായും വായിക്കുക "]
[]
[]
[null,null,null," Taxable Income of concerned Financial Years (may be zero for a new salary recipient)"]
[null,"Notes ","2017-18",{"$f":"IF(D16=\"\",\"Not needed\",\"2016-17 Rs\")","v":"2016-17 Rs"},{"$f":"IF(E16=\"\",\"Not needed\",\"2015-16 Rs\")","v":"2015-16 Rs"},{"$f":"IF(F16=\"\",\"Not needed\",\"2014-15 Rs\")","v":"2014-15 Rs"},{"$f":"IF(G16=\"\",\"Not needed\",\"2013-14 Rs\")","v":"2013-14 Rs"},{"$f":"IF(H16=\"\",\"Not needed\",\"2012-13 Rs\")","v":"2012-13 Rs"},{"$f":"IF(I16=\"\",\"Not needed\",\"2011-12 Rs\")","v":"2011-12 Rs"},{"$f":"IF(J16=\"\",\"Not needed\",\"2010-11 Rs\")","v":"2010-11 Rs"},{"$f":"IF(K16=\"\",\"Not needed\",\"2009-10 Rs\")","v":"2009-10 Rs"}]
[6,null,{"$f":"'ARREAR SPLIT'!C85","v":2},{"$f":"'ARREAR SPLIT'!D85","v":3},{"$f":"'ARREAR SPLIT'!E85","v":4},{"$f":"'ARREAR SPLIT'!F85","v":5},{"$f":"'ARREAR SPLIT'!G85","v":6},{"$f":"'ARREAR SPLIT'!H85","v":7},{"$f":"'ARREAR SPLIT'!I85","v":8},{"$f":"'ARREAR SPLIT'!J85","v":9},{"$f":"'ARREAR SPLIT'!K85","v":10},"Scroll mouse to top to see details above"]
[null,null,null,{"$f":"IF(SUM(E16:K16)=0,\"You can skip this field\",\"Show chapter VI A deductions of concerned years which is demanded by the software\")","v":"You can skip this field"},null,null,null,null,null,null,null,"ഇളവു ലഭിക്കുന്ന തുക മൌസ് സ്ക്രോള്‍ ചെയ്ത് ചുവടെ കാണാം "]
[null,null,null,{"$f":"IF(D25=0,D24,\"Never show\")","v":"Never show"},"Never show","Never show","Never show","Never show","Never show","Never show","Never show"]
[7,null,null,{"$f":"'ARREAR SPLIT'!D89","v":0},{"$f":"'ARREAR SPLIT'!E89","v":0},{"$f":"'ARREAR SPLIT'!F89","v":0},{"$f":"'ARREAR SPLIT'!G89","v":0},{"$f":"'ARREAR SPLIT'!H89","v":0},{"$f":"'ARREAR SPLIT'!I89","v":0},{"$f":"'ARREAR SPLIT'!J89","v":0},{"$f":"'ARREAR SPLIT'!K89","v":0}]
[]
[null,{"$f":"IF(K12=0,\"\",IF('ARREAR SPLIT'!L127>1,\"താങ്കള്‍ 10 E ഫോം മാനുവല്‍ ആയി തയ്യാറാക്കുന്നതിനുള്ള ഓപ്ഷന്‍ സ്വീകരിച്ചതിനാല്‍ മുകളിലുള്ള തുകകള്‍ പരിഗണിക്കാതെ താങ്കള്‍ എഴുതിച്ചേര്‍ത്ത തുക പരിഗണിച്ചിരിക്കുന്നു Click Continue 2\",IF(E25=\"\",\"Fill details of sixth row. If you are receiving salary income  first time during this year, values in fifth row will be zero താങ്കള്‍ ആറാം റോ പൂരിപ്പിചിട്ടില്ല, ഇപ്പോള്‍ ആദ്യമായി വരുമാനം നേടുന്നവര്‍ അവിടെ  പൂജ്യം നല്‍കാം \",\"5,6, ചോദ്യങ്ങള്‍ക്ക് വിവരങ്ങള്‍ പൂര്‍ണ്ണമായി നല്‍കിയാല്‍ താങ്കളുടെ ഇളവു വലത്തുവശത്തു കാണുംവിധമാണ്. ‍If your data entry is over, your relief amount is shown in right side. Click Continue 1 \")))","v":""},null,null,null,null,null,null,null,null,null,{"$f":"IF(K100>1,K100,\"Relief Rs. \"&'Form 10E'!H40)","v":"Relief Rs. 0"}]
[null,null,null,null,null,null,null,null,null,null,null,null,{"$f":"IF(K100>1,\"Click Continue 2\",\"Click continue 1\")","v":"Click continue 1"}]
[null,null,null,null,{"$f":"IF(K100>1,\"താങ്കള്‍ 10 E ഫോം മാനുവല്‍ ആയി തയ്യാറാക്കുന്നതിനുള്ള ഓപ്ഷന്‍ സ്വീകരിച്ചതിനാല്‍ ഈ സംവിധാനത്തില്‍ നിന്നും ലഭിക്കുന്ന ഫോം 10 E സെറ്റ് ഉപയോഗിക്കരുത് എന്നാല്‍ Incometax Statement, Form 16 പ്രിന്റുകള്‍ പരിഗണിക്കാവുന്നതാണ്\",IF(L30=0,\"\",IF(L30=\"\",\"Sorry, you cannot claim for Relief, You are not needed to take printouts of Form 10E\",\" If you filled row number 6, you are benifited with following relief. Nothing more to do, Click CONTINUE - 1 button, and take all printouts. If you are benifited, then only you have to submit tax satements of previous years, Form 10 E set additionally\")))","v":" If you filled row number 6, you are benifited with following relief. Nothing more to do, Click CONTINUE - 1 button, and take all printouts. If you are benifited, then only you have to submit tax satements of previous years, Form 10 E set additionally"}]
[]
[]
[]
[]
[]
[]
[]
[]
[]
[]
[]
[]
[]
[]
[]
[]
[]
[]
[]
[]
[]
[]
[]
[]
[]
[]
[]
[]
[]
[]
[]
[]
[]
[]
[]
[]
[]
[]
[]
[]
[]
[]
[]
[]
[]
[]
[]
[]
[]
[]
[]
[]
[]
[]
[]
[]
[]
[]
[]
[]
[]
[]
[]
[]
[]
[null,null,null,null,"Form 10 E mannual preparation directions only"]
[null,null,null,null,"Are you ready to prepare 10 E forms manually (താങ്കള്‍ 10 E ഫോം മാന്വല്‍ ആയി തയ്യാറാക്കാന്‍ ഉദ്ദേശിക്കുന്നുവോ  ? [Choose Yes / No ]",null,null,null,null,null,"NO",null,"YES","`"]
[null,null,null,null,{"$f":"IF(K99=\"NO\",\"\",\"ഞാന്‍ manual ആയി കണക്കു കൂട്ടിയെടുത്ത 89 (1) Relief തുക വലതുവശത്ത്‌ നല്‍കുന്നു -[89 (1) Relief amount manually calculated by preparing Form 10-E   Rs.]\")","v":""},null,null,null,null,null,null,null,"NO"]
[]
[null,null,null,null,{"$f":"IF(K100>0,\"Caution : Since you are going to prepare 10 E Forms manually. Never take printouts of Form 10 E (Annexure 1, Table A) generated by this software. But you can use Income tax statement, Form 16 statement etc. generated from this .\",\"\")","v":""}]
[null,null,null,null,{"$f":"IF(K100>0,\"താങ്കള്‍ 10 E Forms manual ആയി തയ്യാറാക്കുന്നതിനാല്‍ ഈ സംവിധാനത്തില്‍നിന്നും ലഭിക്കുന്ന 10 E Forms പ്രിന്റ് എടുക്കരുത് അതേസമയം Income tax statement, Form 16 എന്നിവ ഇതില്‍നിന്നും ഉപയോഗിക്കാവുന്നതാണ്\",\"\")","v":""}]

{"sheet":"Calc","index":25,"n_rows":31,"n_cols":10,"rows_kept":31,"cut":false,"hidden":true,"merged":[]}
[1,"st","January",null,"Male",{"$f":"ROUND(IF(Data!M$24>1000000,130000+(Data!M$24-1000000)*0.3,IF(Data!M$24>500000,30000+(Data!M$24-500000)*0.2,IF(Data!M$24>200000,(Data!M$24-200000)*0.1,0))),0)","v":0},{"$f":"ROUND(IF(Data!N$24>1000000,130000+(Data!N$24-1000000)*0.3,IF(Data!N$24>500000,30000+(Data!N$24-500000)*0.2,IF(Data!N$24>200000,(Data!N$24-200000)*0.1,0))),0)","v":0},{"$f":"ROUND(IF(Data!O$24>800000,92000+(Data!O$24-800000)*0.3,IF(Data!O$24>500000,32000+(Data!O$24-500000)*0.2,IF(Data!O$24>180000,(Data!O$24-180000)*0.1,0))),0)","v":0},{"$f":"ROUND(IF(Data!P$24>800000,94000+(Data!P$24-800000)*0.3,IF(Data!P$24>500000,34000+(Data!P$24-500000)*0.2,IF(Data!P$24>160000,(Data!P$24-160000)*0.1,0))),0)","v":0},{"$f":"ROUND(IF(Data!Q$24>500000,54000+(Data!Q$24-500000)*0.3,IF(Data!Q$24>300000,14000+(Data!Q$24-300000)*0.2,IF(Data!Q$24>160000,(Data!Q$24-160000)*0.1,0))),0)","v":0}]
[2,"nd","February",null,"female",{"$f":"ROUND(IF(Data!M$24>1000000,130000+(Data!M$24-1000000)*0.3,IF(Data!M$24>500000,30000+(Data!M$24-500000)*0.2,IF(Data!M$24>200000,(Data!M$24-200000)*0.1,0))),0)","v":0},{"$f":"ROUND(IF(Data!N$24>1000000,130000+(Data!N$24-1000000)*0.3,IF(Data!N$24>500000,30000+(Data!N$24-500000)*0.2,IF(Data!N$24>200000,(Data!N$24-200000)*0.1,0))),0)","v":0},{"$f":"ROUND(IF(Data!O$24>800000,91000+(Data!O$24-800000)*0.3,IF(Data!O$24>500000,31000+(Data!O$24-500000)*0.2,IF(Data!O$24>190000,(Data!O$24-190000)*0.1,0))),0)","v":0},{"$f":"ROUND(IF(Data!P$24>800000,91000+(Data!P$24-800000)*0.3,IF(Data!P$24>500000,31000+(Data!P$24-500000)*0.2,IF(Data!P$24>190000,(Data!P$24-190000)*0.1,0))),0)","v":0},{"$f":"ROUND(IF(Data!Q$24>500000,51000+(Data!Q$24-500000)*0.3,IF(Data!Q$24>300000,11000+(Data!Q$24-300000)*0.2,IF(Data!Q$24>190000,(Data!Q$24-190000)*0.1,0))),0)","v":0}]
[3,"rd","March",null,"sr citizen",{"$f":"ROUND(IF(Data!M$24>1000000,125000+(Data!M$24-1000000)*0.3,IF(Data!M$24>500000,25000+(Data!M$24-500000)*0.2,IF(Data!M$24>250000,(Data!M$24-250000)*0.1,0))),0)","v":0},{"$f":"ROUND(IF(Data!N$24>1000000,125000+(Data!N$24-1000000)*0.3,IF(Data!N$24>500000,25000+(Data!N$24-500000)*0.2,IF(Data!N$24>250000,(Data!N$24-250000)*0.1,0))),0)","v":0},{"$f":"ROUND(IF(Data!O$24>800000,85000+(Data!O$24-800000)*0.3,IF(Data!O$24>500000,25000+(Data!O$24-500000)*0.2,IF(Data!O$24>250000,(Data!O$24-250000)*0.1,0))),0)","v":0},{"$f":"ROUND(IF(Data!P$24>800000,86000+(Data!P$24-800000)*0.3,IF(Data!P$24>500000,26000+(Data!P$24-500000)*0.2,IF(Data!P$24>240000,(Data!P$24-240000)*0.1,0))),0)","v":0},{"$f":"ROUND(IF(Data!Q$24>500000,46000+(Data!Q$24-500000)*0.3,IF(Data!Q$24>300000,6000+(Data!Q$24-300000)*0.2,IF(Data!Q$24>240000,(Data!Q$24-240000)*0.1,0))),0)","v":0}]
[4,"th","April",null,"sr citizen2",{"$f":"ROUND(IF(Data!M$24>1000000,50000+(Data!M$24-1000000)*0.3,IF(Data!M$24>500000,(Data!M$24-500000)*0.2,0)),0)","v":0},{"$f":"ROUND(IF(Data!N$24>1000000,50000+(Data!N$24-1000000)*0.3,IF(Data!N$24>500000,(Data!N$24-500000)*0.2,0)),0)","v":0},{"$f":"ROUND(IF(Data!O$24>800000,60000+(Data!O$24-800000)*0.3,IF(AND(Data!O$24>500000,Data!O$24<800000),(Data!O$24-500000)*0.2,0)),0)","v":0},{"$f":"ROUND(IF(Data!P$24>800000,86000+(Data!P$24-800000)*0.3,IF(Data!P$24>500000,26000+(Data!P$24-500000)*0.2,IF(Data!P$24>240000,(Data!P$24-240000)*0.1,0))),0)","v":0},{"$f":"ROUND(IF(Data!Q$24>500000,46000+(Data!Q$24-500000)*0.3,IF(Data!Q$24>300000,6000+(Data!Q$24-300000)*0.2,IF(Data!Q$24>240000,(Data!Q$24-240000)*0.1,0))),0)","v":0}]
[5,"th","May"]
[6,"th","June"]
[7,"th","July",null,"Male",{"$f":"ROUND(IF(Data!M$36>1000000,130000+(Data!M$36-1000000)*0.3,IF(Data!M$36>500000,30000+(Data!M$36-500000)*0.2,IF(Data!M$36>200000,(Data!M$36-200000)*0.1,0))),0)","v":0},{"$f":"ROUND(IF(Data!N$36>1000000,130000+(Data!N$36-1000000)*0.3,IF(Data!N$36>500000,30000+(Data!N$36-500000)*0.2,IF(Data!N$36>200000,(Data!N$36-200000)*0.1,0))),0)","v":0},{"$f":"ROUND(IF(Data!O$36>800000,92000+(Data!O$36-800000)*0.3,IF(Data!O$36>500000,32000+(Data!O$36-500000)*0.2,IF(Data!O$36>180000,(Data!O$36-180000)*0.1,0))),0)","v":0},{"$f":"ROUND(IF(Data!P$36>800000,94000+(Data!P$36-800000)*0.3,IF(Data!P$36>500000,34000+(Data!P$36-500000)*0.2,IF(Data!P$36>160000,(Data!P$36-160000)*0.1,0))),0)","v":0},{"$f":"ROUND(IF(Data!Q$36>500000,54000+(Data!Q$36-500000)*0.3,IF(Data!Q$36>300000,14000+(Data!Q$36-300000)*0.2,IF(Data!Q$36>160000,(Data!Q$36-160000)*0.1,0))),0)","v":0}]
[8,"th","August",null,"female",{"$f":"ROUND(IF(Data!M$36>1000000,130000+(Data!M$36-1000000)*0.3,IF(Data!M$36>500000,30000+(Data!M$36-500000)*0.2,IF(Data!M$36>200000,(Data!M$36-200000)*0.1,0))),0)","v":0},{"$f":"ROUND(IF(Data!N$36>1000000,130000+(Data!N$36-1000000)*0.3,IF(Data!N$36>500000,30000+(Data!N$36-500000)*0.2,IF(Data!N$36>200000,(Data!N$36-200000)*0.1,0))),0)","v":0},{"$f":"ROUND(IF(Data!O$36>800000,91000+(Data!O$36-800000)*0.3,IF(Data!O$36>500000,31000+(Data!O$36-500000)*0.2,IF(Data!O$36>190000,(Data!O$36-190000)*0.1,0))),0)","v":0},{"$f":"ROUND(IF(Data!P$36>800000,91000+(Data!P$36-800000)*0.3,IF(Data!P$36>500000,31000+(Data!P$36-500000)*0.2,IF(Data!P$36>190000,(Data!P$36-190000)*0.1,0))),0)","v":0},{"$f":"ROUND(IF(Data!Q$36>500000,51000+(Data!Q$36-500000)*0.3,IF(Data!Q$36>300000,11000+(Data!Q$36-300000)*0.2,IF(Data!Q$36>190000,(Data!Q$36-190000)*0.1,0))),0)","v":0}]
[9,"th","September",null,"sr citizen",{"$f":"ROUND(IF(Data!M$36>1000000,125000+(Data!M$36-1000000)*0.3,IF(Data!M$36>500000,25000+(Data!M$36-500000)*0.2,IF(Data!M$36>250000,(Data!M$36-250000)*0.1,0))),0)","v":0},{"$f":"ROUND(IF(Data!N$36>1000000,125000+(Data!N$36-1000000)*0.3,IF(Data!N$36>500000,25000+(Data!N$36-500000)*0.2,IF(Data!N$36>250000,(Data!N$36-250000)*0.1,0))),0)","v":0},{"$f":"ROUND(IF(Data!O$36>800000,85000+(Data!O$36-800000)*0.3,IF(Data!O$36>500000,25000+(Data!O$36-500000)*0.2,IF(Data!O$36>250000,(Data!O$36-250000)*0.1,0))),0)","v":0},{"$f":"ROUND(IF(Data!P$36>800000,86000+(Data!P$36-800000)*0.3,IF(Data!P$36>500000,26000+(Data!P$36-500000)*0.2,IF(Data!P$36>240000,(Data!P$36-240000)*0.1,0))),0)","v":0},{"$f":"ROUND(IF(Data!Q$36>500000,46000+(Data!Q$36-500000)*0.3,IF(Data!Q$36>300000,6000+(Data!Q$36-300000)*0.2,IF(Data!Q$36>240000,(Data!Q$36-240000)*0.1,0))),0)","v":0}]
[10,"th","October",null,"sr citizen2",{"$f":"ROUND(IF(Data!M$36>1000000,50000+(Data!M$36-1000000)*0.3,IF(Data!M$36>500000,(Data!M$36-500000)*0.2,0)),0)","v":0},{"$f":"ROUND(IF(Data!N$36>1000000,50000+(Data!N$36-1000000)*0.3,IF(Data!N$36>500000,(Data!N$36-500000)*0.2,0)),0)","v":0},{"$f":"ROUND(IF(Data!O$36>800000,60000+(Data!O$36-800000)*0.3,IF(AND(Data!O$36>500000,Data!O$36<800000),(Data!O$36-500000)*0.2,0)),0)","v":0},{"$f":"ROUND(IF(Data!P$36>800000,86000+(Data!P$36-800000)*0.3,IF(Data!P$36>500000,26000+(Data!P$36-500000)*0.2,IF(Data!P$36>240000,(Data!P$36-240000)*0.1,0))),0)","v":0},{"$f":"ROUND(IF(Data!Q$36>500000,46000+(Data!Q$36-500000)*0.3,IF(Data!Q$36>300000,6000+(Data!Q$36-300000)*0.2,IF(Data!Q$36>240000,(Data!Q$36-240000)*0.1,0))),0)","v":0}]
[11,"th","November"]
[12,"th","December"]
[13,"th"]
[14,"th"]
[15,"th"]
[16,"th"]
[17,"th"]
[18,"th"]
[19,"th"]
[20,"th"]
[21,"st"]
[22,"nd"]
[23,"rd"]
[24,"th"]
[25,"th"]
[26,"th"]
[27,"th"]
[28,"th"]
[29,"th"]
[30,"th"]
[31,"st"]

{"sheet":"Data","index":26,"n_rows":215,"n_cols":28,"rows_kept":215,"cut":false,"hidden":true,"merged":[[125,23,125,24],[135,23,135,24],[113,23,113,24],[113,27,113,28],[19,19,19,20],[31,19,31,20],[11,19,11,20],[12,19,12,20],[169,14,172,14],[180,14,183,14],[192,1,196,1],[192,14,195,14],[196,2,196,14],[186,1,190,1],[186,14,189,14],[190,2,190,14],[159,1,162,1],[159,14,162,14],[180,1,184,1],[164,1,167,1],[139,1,142,1],[144,1,147,1],[184,2,184,14],[164,14,167,14],[174,1,178,1],[174,14,177,14],[178,2,178,14],[169,1,172,1],[31,2,31,16],[43,2,43,15],[31,1,41,1],[41,2,41,15],[154,1,157,1],[154,14,157,14],[139,14,142,14],[144,14,147,14],[149,1,152,1],[149,14,152,14],[0,1,0,16],[1,1,1,16],[2,1,2,16],[17,1,17,16],[3,1,3,16],[5,1,9,1],[4,2,4,10],[5,12,5,16],[7,2,7,10],[8,2,8,10],[9,2,9,10],[11,2,11,16],[8,12,8,16],[7,12,7,16],[6,12,6,16],[9,15,9,16],[198,1,202,1],[5,24,5,25],[16,22,16,28],[19,22,19,28],[16,1,16,16],[15,15,15,16],[5,2,5,10],[6,2,6,10],[10,2,10,16],[19,2,19,16],[15,2,15,14],[11,1,15,1],[30,1,30,16],[19,1,29,1],[29,2,29,14],[42,1,42,16],[197,19,201,19],[197,25,200,25],[201,20,201,25],[198,14,201,14],[202,2,202,14],[204,14,207,14],[204,1,208,1],[208,2,208,14],[210,1,214,1],[210,14,213,14],[214,2,214,14]]}
[null,"ARRANGEMENT FIELD"]
[]
[]
[]
[null,null,"AGE GROUP",null,null,null,null,null,null,null,null,null,{"$f":"PERSONAL!H5","v":"Below 60 Years"}]
[null,"PERSONAL","NAME",null,null,null,null,null,null,null,null,null,{"$f":"'[2]personal '!C4","v":"JYOTHSNA K M"},null,null,null,null,null,null,null,null,null,"updated on ","30-1-2014","To download the latest version of the programme, if available, ",null,"CLICK HERE"]
[null,null,"Designation",null,null,null,null,null,null,null,null,null,{"$f":"'[2]personal '!C6","v":"LAB TECHNICAL ASSISTANT"}]
[null,null,"Office",null,null,null,null,null,null,null,null,null,{"$f":"'[2]personal '!C7","v":"KNMVHSS VATANAPPALLY"}]
[null,null,"PAN",null,null,null,null,null,null,null,null,null,{"$f":"'[2]personal '!C5","v":"ARDPJ4875E"}]
[null,null,"MALE OR FEMALE",null,null,null,null,null,null,null,null,null,null,null,null,{"$f":"'arrear det'!L3","v":"Male"}]
[]
[null,"SALARY SPLIT","ARREARS OF YEARS - ACCRUEL BASIS OLD REGIME",null,null,null,null,null,null,null,null,null,null,null,null,null,null,null,null,"OLD REGIME CURRENT"]
[null,null,"FINANCIAL YEAR","2022-23","2021-22","2020-21","2019-20","2018-19","2017-18","2016-17","2015-16","2014-15","2013-14","2012-13","2011-12","2010-11","2009-10",null,null,"2021-22"]
[null,null,"Tot  inc  without arrear",{"$f":"'new statement'!R59-'new statement'!D92-'new statement'!D93-'new statement'!D95+'det.sal input'!W27","v":0},{"$f":"'ARREAR SPLIT'!N27","v":2},{"$f":"'ARREAR SPLIT'!M27","v":0},{"$f":"'ARREAR SPLIT'!L27","v":0},{"$f":"'ARREAR SPLIT'!K27","v":0},{"$f":"'ARREAR SPLIT'!J27","v":0},{"$f":"'ARREAR SPLIT'!I27","v":0},{"$f":"'ARREAR SPLIT'!H27","v":0},{"$f":"'ARREAR SPLIT'!G27","v":0},{"$f":"'ARREAR SPLIT'!F27","v":0},{"$f":"'ARREAR SPLIT'!E27","v":0},{"$f":"'ARREAR SPLIT'!D27","v":0},{"$f":"'ARREAR SPLIT'!C27","v":0},{"$f":"'ARREAR SPLIT'!B27","v":0},null,null,{"$f":"'new statement (2)'!R12-'new statement (2)'!L92-'new statement (2)'!L93+'det.sal input'!W27","v":0},"TOT INCOME WITHOUT ARRERA"]
[null,null,"Arr split",{"$f":"'ARREAR SPLIT'!N22","v":0},{"$f":"'ARREAR SPLIT'!N22","v":0},{"$f":"'ARREAR SPLIT'!M22","v":0},{"$f":"'ARREAR SPLIT'!L22","v":0},{"$f":"'ARREAR SPLIT'!K22","v":0},{"$f":"'ARREAR SPLIT'!J22","v":0},{"$f":"'ARREAR SPLIT'!I22","v":0},{"$f":"'ARREAR SPLIT'!H22","v":0},{"$f":"'ARREAR SPLIT'!G22","v":0},{"$f":"'ARREAR SPLIT'!F22","v":0},{"$f":"'ARREAR SPLIT'!E22","v":0},{"$f":"'ARREAR SPLIT'!D22","v":0},{"$f":"'ARREAR SPLIT'!C22","v":0},{"$f":"'ARREAR SPLIT'!B22","v":0},null,null,{"$f":"E15","v":0},"ARREAR SPLIT"]
[null,null,"Current year total Arrears ",null,null,null,null,null,null,null,null,null,null,null,null,{"$f":"SUM(K15:Q15)","v":0},null,null,null,{"$f":"T14+T15","v":0}]
[]
[null,"AUTOMATIC FIELD"]
[]
[null,"ACTUAL SPLIT"," ON RECEIPT BASIS TAX OLD REGIME",null,null,null,null,null,null,null,null,null,null,null,null,null,null,null,null,"NEW REGIME RECEIPT BASE"]
[null,null,"FINANCIAL YEAR","2022-23","2021-22","2020-21","2019-20","2018-19","2017-18","2016-17","2015-16","2014-15","2013-14","2012-13","2011-12","2010-11","2009-10",null,null,"2020-21","YEAR"]
[null,null,"Total Income excluding arrears",{"$f":"D14","v":0},{"$f":"E14","v":2},{"$f":"F14","v":0},0,0,0,0,0,{"$f":"L14","v":0},0,0,0,0,0,null,null,{"$f":"F22","v":0},"Taxable income"]
[null,null,"Add: Arrears of salary",{"$f":"'new statement'!L92+'new statement'!L93-'det.sal input'!W27","v":0},null,null,null,null,null,null,null,null,null,null,null,null,null,null,null,null,"ARREAR"]
[null,null,"Total Income point 1",{"$f":"SUM(E22:E23)","v":2},{"$f":"SUM(E22:E23)","v":2},0,0,0,0,0,0,{"$f":"SUM(L22:L23)","v":0},0,0,0,0,0,null,null,{"$f":"T22+T23","v":0},"TOTAL INC"]
[null,null,"Tax on total income 1",{"$f":"'new form 16'!N80","v":0},{"$f":"'new form 16'!N80","v":0},{"$f":"L123","v":0},{"$f":"L111","v":0},{"$f":"L99","v":0},{"$f":"L88","v":0},{"$f":"L77","v":0},{"$f":"L66","v":0},{"$f":"L55","v":0},{"$f":"IF($P10=\"Male\",Calc!F1,IF($P10=\"Female\",Calc!F2,IF($P10=\"Senior Citizen (65-79)\",Calc!F3,IF($P10=\"Senior Citizen (above 80)\",Calc!F4,\"Category Not Selected\"))))","v":0},{"$f":"IF($P10=\"Male\",Calc!G1,IF($P10=\"Female\",Calc!G2,IF($P10=\"Senior Citizen (65-79)\",Calc!G3,IF($P10=\"Senior Citizen (above 80)\",Calc!G4,\"Category Not Selected\"))))","v":0},{"$f":"IF($P10=\"Male\",Calc!H1,IF($P10=\"Female\",Calc!H2,IF($P10=\"Senior Citizen (65-79)\",Calc!H3,IF($P10=\"Senior Citizen (above 80)\",Calc!H4,\"Category Not Selected\"))))","v":0},{"$f":"IF($P10=\"Male\",Calc!I1,IF($P10=\"Female\",Calc!I2,IF($P10=\"Senior Citizen (65-79)\",Calc!I3,IF($P10=\"Senior Citizen (above 80)\",Calc!I4,\"Category Not Selected\"))))","v":0},{"$f":"IF($P10=\"Male\",Calc!J1,IF($P10=\"Female\",Calc!J2,IF($P10=\"Senior Citizen (65-79)\",Calc!J3,IF($P10=\"Senior Citizen (above 80)\",Calc!J4,\"Category Not Selected\"))))","v":0},null,null,{"$f":"IF(T24<250001,0,IF(T24<500001,(T24-250000)/20,IF(T24<750001,(12500+(T24-500000)/10),IF(T24<1000001,(37500+(T24-750000)*15/100),IF(T24<1250001,75000+(T24-1000000)/5,IF(T24<1500001,125000+(T24-1250000)/4,187500+(T24-1500000)*30/100))))))","v":0},"Tax on tot inc",null,null,{"$f":"IF(AB40<250001,0,IF(AB40<500001,(AB40-250000)/20,IF(AB40<750001,(12500+(AB40-500000)/10),IF(AB40<1000001,(37500+(AB40-750000)*15/100),IF(AB40<1250001,75000+(AB40-1000000)/5,IF(AB40<1500001,125000+(AB40-1250000)/4,187500+(AB40-1500000)*30/100))))))","v":0}]
[null,null,"Less Rebate u/s 87A ( If Total income doesnot exceed Rs.5 Lakhs)",{"$f":"'new form 16'!N86","v":0},{"$f":"'new form 16'!N86","v":0},{"$f":"IF(F25=\"0\",\"0\",IF(F25<12500,F25,IF(AND(F25>12499,F24<500001),12500,IF(F24>500000,\"0\"))))","v":0},{"$f":"IF(G25=\"0\",\"0\",IF(G25<12500,G25,IF(AND(G25>12499,G24<500001),12500,IF(G24>500000,\"0\"))))","v":0},{"$f":"IF(H25=\"0\",\"0\",IF(H25<2500,H25,IF(AND(H25>2499,H24<350001),2500,IF(H24>350000,\"0\"))))","v":0},{"$f":"IF(I25=\"0\",\"0\",IF(I25<2500,I25,IF(AND(I25>2499,I24<350001),2500,IF(I24>350000,\"0\"))))","v":0},{"$f":"IF(J25=\"0\",\"0\",IF(J25<5000,J25,IF(AND(J25>4999,J24<500001),5000,IF(J24>500000,\"0\"))))","v":0},{"$f":"IF(K25=\"0\",\"0\",IF(K25<2000,K25,IF(AND(K25>1999,K24<500001),2000,IF(K24>500000,\"0\"))))","v":0},{"$f":"IF(L25=\"0\",\"0\",IF(L25<2000,L25,IF(AND(L25>1999,L24<500001),2000,IF(L24>500000,\"0\"))))","v":0},{"$f":"IF(M25=\"0\",\"0\",IF(M25<2000,M25,IF(AND(M25>1999,M24<500001),2000,IF(M24>500000,\"0\"))))","v":0},"NA","NA","NA","NA",null,null,{"$f":"IF(T25=\"0\",\"0\",IF(T25<12500,T25,IF(AND(T25>12499,T24<500001),12500,IF(T24>500000,\"0\"))))","v":0},"87A REBATE"]
[null,null,"Tax after Rebate",{"$f":"IF(ISERROR(E25-E26),E25,IF(E25-E26=0,\"0\",E25-E26))","v":"0"},{"$f":"IF(ISERROR(E25-E26),E25,IF(E25-E26=0,\"0\",E25-E26))","v":"0"},"0","0","0","0","0","0","0","0",{"$f":"N25","v":0},{"$f":"O25","v":0},{"$f":"P25","v":0},{"$f":"Q25","v":0},null,null,{"$f":"IF(ISERROR(T25-T26),T25,IF(T25-T26=0,\"0\",T25-T26))","v":"0"},"Tax after Rebate"]
[null,null,"Add - Education cess",{"$f":"IF(ISERROR(ROUND((E27*0.04),0)),\"\",ROUND((E27*0.04),0))","v":0},{"$f":"IF(ISERROR(ROUND((E27*0.04),0)),\"\",ROUND((E27*0.04),0))","v":0},{"$f":"IF(ISERROR(ROUND((F27*0.04),0)),\"\",ROUND((F27*0.04),0))","v":0},{"$f":"IF(ISERROR(ROUND((G27*0.04),0)),\"\",ROUND((G27*0.04),0))","v":0},{"$f":"IF(ISERROR(ROUND((H27*0.04),0)),\"\",ROUND((H27*0.04),0))","v":0},{"$f":"IF(ISERROR(ROUND((I27*0.03),0)),\"\",ROUND((I27*0.03),0))","v":0},{"$f":"IF(ISERROR(ROUND((J27*0.03),0)),\"\",ROUND((J27*0.03),0))","v":0},{"$f":"IF(ISERROR(ROUND((K27*0.03),0)),\"\",ROUND((K27*0.03),0))","v":0},0,0,0,0,0,0,null,null,{"$f":"IF(ISERROR(ROUND((T27*0.04),0)),\"\",ROUND((T27*0.04),0))","v":0},"Add - Education cess"]
[null,null,"Total tax",{"$f":"SUM(E27:E28)","v":0},{"$f":"SUM(E27:E28)","v":0},0,0,0,0,0,{"$f":"SUM(K27:K28)","v":0},0,0,0,0,0,0,null,null,{"$f":"SUM(T27:T28)","v":0},"Total tax"]
[null,null,"TOTAL TAX",null,null,null,null,null,null,null,null,null,null,null,null,null,{"$f":"SUM(K29:Q29)","v":0}]
[]
[null,"ACCRUAL SPLIT","ACCRUAL BASIS TAX OLD REGIME",null,null,null,null,null,null,null,null,null,null,null,null,null,null,null,null,"NEW REGIME ACCRUAL"]
[null,null,"F YEAR","2022-23","2021-22","2020-21","2019-20","2018-19","2017-18","2016-17","2015-16","2014-15","2013-14","2012-13","2011-12","2010-11","2009-10",null,null,"2020-21","YEAR"]
[null,null,"Total Income excluding arrears -STD DED point 1",{"$f":"D14+'ARREAR SPLIT'!N5-R35","v":0},{"$f":"E14+'ARREAR SPLIT'!N5-R35","v":2},{"$f":"F22","v":0},{"$f":"G22","v":0},{"$f":"H22","v":0},{"$f":"I22","v":0},{"$f":"J22","v":0},0,0,0,0,0,0,0,null,null,{"$f":"F34","v":0},"Taxable income"]
[null,null,"Add: Arrears of salary",{"$f":"D15-'det.sal input'!W27","v":0},{"$f":"E15-'det.sal input'!W27","v":0},{"$f":"F15","v":0},{"$f":"G15","v":0},{"$f":"H15","v":0},{"$f":"I15","v":0},{"$f":"J15","v":0},0,0,0,0,0,0,0,{"$f":"SUM(F35:Q35)","v":0},null,{"$f":"F35","v":0},"ARREAR"]
[null,null,"Total less VI A DED",{"$f":"D34+D35","v":0},{"$f":"E34+E35","v":2},{"$f":"F34+F35","v":0},{"$f":"G34+G35","v":0},0,0,0,0,0,0,0,0,0,0,null,null,{"$f":"T34+T35","v":0},"TOTAL INC"]
[null,null,"Tax on total income on 1",{"$f":"'new form 16'!N111","v":0},{"$f":"'new form 16'!N111","v":0},{"$f":"Q123","v":0},{"$f":"Q111","v":0},{"$f":"Q99","v":0},{"$f":"Q88","v":0},{"$f":"Q77","v":0},{"$f":"Q66","v":0},{"$f":"Q55","v":0},{"$f":"IF($P10=\"Male\",Calc!F7,IF($P10=\"Female\",Calc!F8,IF($P10=\"Senior Citizen (65-79)\",Calc!F9,IF($P10=\"Senior Citizen (above 80)\",Calc!F10,\"Select Category\"))))","v":0},{"$f":"IF($P10=\"Male\",Calc!G7,IF($P10=\"Female\",Calc!G8,IF($P10=\"Senior Citizen (65-79)\",Calc!G9,IF($P10=\"Senior Citizen (above 80)\",Calc!G10,\"Select Category\"))))","v":0},{"$f":"IF($P10=\"Male\",Calc!H7,IF($P10=\"Female\",Calc!H8,IF($P10=\"Senior Citizen (65-79)\",Calc!H9,IF($P10=\"Senior Citizen (above 80)\",Calc!H10,\"Select Category\"))))","v":0},{"$f":"IF($P10=\"Male\",Calc!I7,IF($P10=\"Female\",Calc!I8,IF($P10=\"Senior Citizen (65-79)\",Calc!I9,IF($P10=\"Senior Citizen (above 80)\",Calc!I10,\"Select Category\"))))","v":0},{"$f":"IF($P10=\"Male\",Calc!J7,IF($P10=\"Female\",Calc!J8,IF($P10=\"Senior Citizen (65-79)\",Calc!J9,IF($P10=\"Senior Citizen (above 80)\",Calc!J10,\"Select Category\"))))","v":0},null,null,{"$f":"IF(T36<250001,0,IF(T36<500001,(T36-250000)/20,IF(T36<750001,(12500+(T36-500000)/10),IF(T36<1000001,(37500+(T36-750000)*15/100),IF(T36<1250001,75000+(T36-1000000)/5,IF(T36<1500001,125000+(T36-1250000)/4,187500+(T36-1500000)*30/100))))))","v":0},"Tax on tot inc"]
[null,null,"Less Rebate u/s 87A",{"$f":"'new form 16'!N117","v":0},{"$f":"'new form 16'!N117","v":0},{"$f":"IF(F37=\"Nil\",\"0\",IF(F37<12500,F37,IF(AND(F37>12499,F36<500001),12500,IF(F36>500000,\"0\"))))","v":0},{"$f":"IF(G37=\"Nil\",\"0\",IF(G37<12500,G37,IF(AND(G37>12499,G36<500001),12500,IF(G36>500000,\"0\"))))","v":0},{"$f":"IF(H37=\"Nil\",\"0\",IF(H37<2500,H37,IF(AND(H37>2499,H36<350001),2500,IF(H36>350000,\"0\"))))","v":0},{"$f":"IF(I37=\"Nil\",\"0\",IF(I37<2500,I37,IF(AND(I37>2499,I36<350001),2500,IF(I36>350000,\"0\"))))","v":0},{"$f":"IF(J37=\"Nil\",\"0\",IF(J37<5000,J37,IF(AND(J37>4999,J36<500001),5000,IF(J36>500000,\"0\"))))","v":0},{"$f":"IF(K37=\"Nil\",\"0\",IF(K37<2000,K37,IF(AND(K37>1999,K36<500001),2000,IF(K36>500000,\"0\"))))","v":0},{"$f":"IF(L37=\"Nil\",\"0\",IF(L37<2000,L37,IF(AND(L37>1999,L36<500001),2000,IF(L36>500000,\"0\"))))","v":0},{"$f":"IF(M37=\"Nil\",\"0\",IF(M37<2000,M37,IF(AND(M37>1999,M36<500001),2000,IF(M36>500000,\"0\"))))","v":0},"NA","NA","NA","NA",null,null,{"$f":"IF(T37=\"0\",\"0\",IF(T37<12500,T37,IF(AND(T37>12499,T36<500001),12500,IF(T36>500000,\"0\"))))","v":0},"87A REBATE"]
[null,null,"Tax after Rebate",{"$f":"D37-D38","v":0},{"$f":"E37-E38","v":0},{"$f":"IF(ISERROR(F37-F38),F37,IF(F37-F38=0,\"0\",F37-F38))","v":"0"},"0","0","0","0","0","0","0",{"$f":"N37","v":0},{"$f":"O37","v":0},{"$f":"P37","v":0},{"$f":"Q37","v":0},null,null,{"$f":"IF(ISERROR(T37-T38),T37,IF(T37-T38=0,\"0\",T37-T38))","v":"0"},"Tax after Rebate"]
[null,null," Education cess",{"$f":"ROUND((D39*0.04),0)","v":0},{"$f":"ROUND((E39*0.04),0)","v":0},{"$f":"ROUND((F39*0.04),0)","v":0},{"$f":"ROUND((G39*0.04),0)","v":0},{"$f":"ROUND((H39*0.04),0)","v":0},{"$f":"ROUND((I39*0.03),0)","v":0},0,0,0,0,0,0,0,0,null,null,{"$f":"IF(ISERROR(ROUND((T39*0.04),0)),\"\",ROUND((T39*0.04),0))","v":0},"Add - Education cess"]
[null,null,"Total tax Due",{"$f":"SUM(E39:E40)","v":0},{"$f":"SUM(E39:E40)","v":0},{"$f":"SUM(F39:F40)","v":0},{"$f":"SUM(G39:G40)","v":0},{"$f":"SUM(H39:H40)","v":0},{"$f":"SUM(I39:I40)","v":0},0,0,0,0,0,0,0,0,null,null,{"$f":"SUM(T39:T40)","v":0},"Total tax"]
[null,null,"TOTAL",null,null,null,null,null,null,null,null,null,null,null,null,null,{"$f":"SUM(K41:Q41)","v":0}]
[]
[null,"OUTPUT","RELIEF",null,null,null,null,null,null,null,null,null,null,null,null,null,{"$f":"IF(Q42>=Q30,\"Nil\",Q30-Q42)","v":"Nil"}]
[null,null,{"$f":"IF(AND(H35>40000,H34<1),H34+H35-40000,H34+H35)","v":0}]
[null,null,null,null,null,null,null,null,null,null,null,null,"2014-15 tax calculation receipt basis babu",null,null,null,"2014-15 tax calculation accrual babu"]
[null,null,null,null,null,null,null,null,null,null,null,"normal","SENIOR","super senior","TYPE OF PERSON",null,"normal","SENIOR","super senior","TYPE OF PERSON"]
[null,null,null,null,null,null,null,null,null,null,"Taxable income",{"$f":"L24","v":0},{"$f":"L24","v":0},{"$f":"L24","v":0},{"$f":"M5","v":"Below 60 Years"},null,{"$f":"L36","v":0},{"$f":"Q48","v":0},{"$f":"R48","v":0},{"$f":"O48","v":"Below 60 Years"}]
[null,null,null,null,null,null,null,null,null,null,"basic deduction",250000,300000,500000,null,null,250000,300000,500000]
[null,null,null,null,null,null,null,null,null,null,"balance",{"$f":"L48-L49","v":-250000},{"$f":"M48-M49","v":-300000},{"$f":"N48-N49","v":-500000},null,null,{"$f":"Q48-Q49","v":-250000},{"$f":"R48-R49","v":-300000},{"$f":"S48-S49","v":-500000}]
[null,null,null,null,null,null,null,null,null,null,"stage 1",{"$f":"IF(L48<1,0,IF(L48>=500000,25000,L50*0.1))","v":0},{"$f":"IF(M48<1,0,IF(M48>=500000,20000,M50*0.1))","v":0},{"$f":"IF(N50<1,0,IF(N50<=500000,N50*0.2,100000))","v":0},null,null,{"$f":"IF(Q48<1,0,IF(Q48>=500000,25000,Q50*0.1))","v":0},{"$f":"IF(R48<1,0,IF(R48>=500000,20000,R50*0.1))","v":0},{"$f":"IF(S50<1,0,IF(S50<=500000,S50*0.2,100000))","v":0}]
[null,null,null,null,null,null,null,null,null,null,"stage 2",{"$f":"IF(L48<=500000,0,IF(L48<=1000000,(L48-500000)*0.2,IF(L48>1000000,100000)))","v":0},{"$f":"IF(M48<=500000,0,IF(M48<=1000000,(M48-500000)*0.2,IF(M48>1000000,100000)))","v":0},{"$f":"IF(N50>500000,(N50-500000)*0.3)","v":false},null,null,{"$f":"IF(Q48<=500000,0,IF(Q48<=1000000,(Q48-500000)*0.2,IF(Q48>1000000,100000)))","v":0},{"$f":"IF(R48<=500000,0,IF(R48<=1000000,(R48-500000)*0.2,IF(R48>1000000,100000)))","v":0},{"$f":"IF(S50>500000,(S50-500000)*0.3)","v":false}]
[null,null,null,null,null,null,null,null,null,null,"stage 3",{"$f":"IF(L48<=1000000,0,(L48-1000000)*0.3)","v":0},{"$f":"IF(M48<=1000000,0,(M48-1000000)*0.3)","v":0},null,null,null,{"$f":"IF(Q48<=1000000,0,(Q48-1000000)*0.3)","v":0},{"$f":"IF(R48<=1000000,0,(R48-1000000)*0.3)","v":0}]
[null,null,null,null,null,null,null,null,null,null,"tax",{"$f":"L51+L52+L53","v":0},{"$f":"M51+M52+M53","v":0},{"$f":"N51+N52+N53","v":0},null,null,{"$f":"Q51+Q52+Q53","v":0},{"$f":"R51+R52+R53","v":0},{"$f":"S51+S52+S53","v":0}]
[null,null,null,null,null,null,null,null,null,null,"TAX APPLICABLE ABOVE",{"$f":"IF(O48=\"BELOW 60 YEARS\",L54,IF(O48=\"60 TO 79 YEARS\",M54,IF(O48=\"80 AND ABOVE\",N54)))","v":0},null,null,null,null,{"$f":"IF(T48=\"BELOW 60 YEARS\",Q54,IF(T48=\"60 TO 79 YEARS\",R54,IF(T48=\"80 AND ABOVE\",S54)))","v":0}]
[]
[null,null,null,null,null,null,null,null,null,null,null,null,"2015-16 tax calculation receipt basis babu",null,null,null,"2015-16 tax calculation accrual babu"]
[null,null,null,null,null,null,null,null,null,null,null,"normal","SENIOR","super senior","TYPE OF PERSON",null,"normal","SENIOR","super senior","TYPE OF PERSON"]
[null,null,null,null,null,null,null,null,null,null,"Taxable income",{"$f":"K24","v":0},{"$f":"K24","v":0},{"$f":"K24","v":0},{"$f":"M5","v":"Below 60 Years"},null,{"$f":"K36","v":0},{"$f":"K36","v":0},{"$f":"K36","v":0},{"$f":"O48","v":"Below 60 Years"}]
[null,null,null,null,null,null,null,null,null,null,"basic deduction",250000,300000,500000,null,null,250000,300000,500000]
[null,null,null,null,null,null,null,null,null,null,"balance",{"$f":"L59-L60","v":-250000},{"$f":"M59-M60","v":-300000},{"$f":"N59-N60","v":-500000},null,null,{"$f":"Q59-Q60","v":-250000},{"$f":"R59-R60","v":-300000},{"$f":"S59-S60","v":-500000}]
[null,null,null,null,null,null,null,null,null,null,"stage 1",{"$f":"IF(L59<1,0,IF(L59>=500000,25000,L61*0.1))","v":0},{"$f":"IF(M59<1,0,IF(M59>=500000,20000,M61*0.1))","v":0},{"$f":"IF(N61<1,0,IF(N61<=500000,N61*0.2,100000))","v":0},null,null,{"$f":"IF(Q59<1,0,IF(Q59>=500000,25000,Q61*0.1))","v":0},{"$f":"IF(R59<1,0,IF(R59>=500000,20000,R61*0.1))","v":0},{"$f":"IF(S61<1,0,IF(S61<=500000,S61*0.2,100000))","v":0}]
[null,null,null,null,null,null,null,null,null,null,"stage 2",{"$f":"IF(L59<=500000,0,IF(L59<=1000000,(L59-500000)*0.2,IF(L59>1000000,100000)))","v":0},{"$f":"IF(M59<=500000,0,IF(M59<=1000000,(M59-500000)*0.2,IF(M59>1000000,100000)))","v":0},{"$f":"IF(N61>500000,(N61-500000)*0.3)","v":false},null,null,{"$f":"IF(Q59<=500000,0,IF(Q59<=1000000,(Q59-500000)*0.2,IF(Q59>1000000,100000)))","v":0},{"$f":"IF(R59<=500000,0,IF(R59<=1000000,(R59-500000)*0.2,IF(R59>1000000,100000)))","v":0},{"$f":"IF(S59<=1000000,0,(N59-1000000)*0.3)","v":0}]
[null,null,null,null,null,null,null,null,null,null,"stage 3",{"$f":"IF(L59<=1000000,0,(L59-1000000)*0.3)","v":0},{"$f":"IF(M59<=1000000,0,(M59-1000000)*0.3)","v":0},{"$f":"IF(N59<=1000000,0,(N59-1000000)*0.3)","v":0},null,null,{"$f":"IF(Q59<=1000000,0,(Q59-1000000)*0.3)","v":0}]
[null,null,null,null,null,null,null,null,null,null,"tax",{"$f":"L62+L63+L64","v":0},{"$f":"M62+M63+M64","v":0},{"$f":"N62+N63+N64","v":0},null,null,{"$f":"Q62+Q63+Q64","v":0},{"$f":"R62+R63+R64","v":0},{"$f":"S62+S63+S64","v":0}]
[null,null,null,null,null,null,null,null,null,null,"TAX APPLICABLE ABOVE",{"$f":"IF(O59=\"BELOW 60 YEARS\",L65,IF(O59=\"60 TO 79 YEARS\",M65,IF(O59=\"80 AND ABOVE\",N65)))","v":0},null,null,null,null,{"$f":"IF(T59=\"BELOW 60 YEARS\",Q65,IF(T59=\"60 TO 79 YEARS\",R65,IF(T59=\"80 AND ABOVE\",S65)))","v":0}]
[]
[null,null,null,null,null,null,null,null,null,null,null,null,"2016-17 tax calculation receipt basis babu",null,null,null,"2016-17 tax calculation accrual babu"]
[null,null,null,null,null,null,null,null,null,null,null,"normal","SENIOR","super senior","TYPE OF PERSON",null,"normal","SENIOR","super senior","TYPE OF PERSON"]
[null,null,null,null,null,null,null,null,null,null,"Taxable income",{"$f":"J34","v":0},{"$f":"J34","v":0},{"$f":"J34","v":0},{"$f":"M5","v":"Below 60 Years"},null,{"$f":"J36","v":0},{"$f":"J36","v":0},{"$f":"J36","v":0},{"$f":"O59","v":"Below 60 Years"}]
[null,null,null,null,null,null,null,null,null,null,"basic deduction",250000,300000,500000,null,null,250000,300000,500000]
[null,null,null,null,null,null,null,null,null,null,"balance",{"$f":"L70-L71","v":-250000},{"$f":"M70-M71","v":-300000},{"$f":"N70-N71","v":-500000},null,null,{"$f":"Q70-Q71","v":-250000},{"$f":"R70-R71","v":-300000},{"$f":"S70-S71","v":-500000}]
[null,null,null,null,null,null,null,null,null,null,"stage 1",{"$f":"IF(L70<1,0,IF(L70>=500000,25000,L72*0.1))","v":0},{"$f":"IF(M70<1,0,IF(M70>=500000,20000,M72*0.1))","v":0},{"$f":"IF(N72<1,0,IF(N72<=500000,N72*0.2,100000))","v":0},null,null,{"$f":"IF(Q70<1,0,IF(Q70>=500000,25000,Q72*0.1))","v":0},{"$f":"IF(R70<1,0,IF(R70>=500000,20000,R72*0.1))","v":0},{"$f":"IF(S72<1,0,IF(S72<=500000,S72*0.2,100000))","v":0}]
[null,null,null,null,null,null,null,null,null,null,"stage 2",{"$f":"IF(L70<=500000,0,IF(L70<=1000000,(L70-500000)*0.2,IF(L70>1000000,100000)))","v":0},{"$f":"IF(M70<=500000,0,IF(M70<=1000000,(M70-500000)*0.2,IF(M70>1000000,100000)))","v":0},{"$f":"IF(N72>500000,(N72-500000)*0.3)","v":false},null,null,{"$f":"IF(Q70<=500000,0,IF(Q70<=1000000,(Q70-500000)*0.2,IF(Q70>1000000,100000)))","v":0},{"$f":"IF(R70<=500000,0,IF(R70<=1000000,(R70-500000)*0.2,IF(R70>1000000,100000)))","v":0},{"$f":"IF(S70<=1000000,0,(N70-1000000)*0.3)","v":0}]
[null,null,null,null,null,null,null,null,null,null,"stage 3",{"$f":"IF(L70<=1000000,0,(L70-1000000)*0.3)","v":0},{"$f":"IF(M70<=1000000,0,(M70-1000000)*0.3)","v":0},{"$f":"IF(N70<=1000000,0,(N70-1000000)*0.3)","v":0},null,null,{"$f":"IF(Q70<=1000000,0,(Q70-1000000)*0.3)","v":0}]
[null,null,null,null,null,null,null,null,null,null,"tax",{"$f":"L73+L74+L75","v":0},{"$f":"M73+M74+M75","v":0},{"$f":"N73+N74+N75","v":0},null,null,{"$f":"Q73+Q74+Q75","v":0},{"$f":"R73+R74+R75","v":0},{"$f":"S73+S74+S75","v":0}]
[null,null,null,null,null,null,null,null,null,null,"TAX APPLICABLE ABOVE",{"$f":"IF(O70=\"BELOW 60 YEARS\",L76,IF(O70=\"60 TO 79 YEARS\",M76,IF(O70=\"80 AND ABOVE\",N76)))","v":0},null,null,null,null,{"$f":"IF(T70=\"BELOW 60 YEARS\",Q76,IF(T70=\"60 TO 79 YEARS\",R76,IF(T70=\"80 AND ABOVE\",S76)))","v":0}]
[]
[null,null,null,null,null,null,null,null,null,null,null,null,"2017-18 tax calculation receipt basis babu",null,null,null,"2017-18 tax calculation accrual babu"]
[null,null,null,null,null,null,null,null,null,null,null,"normal","SENIOR","super senior","TYPE OF PERSON",null,"normal","SENIOR","super senior","TYPE OF PERSON"]
[null,null,null,null,null,null,null,null,null,null,"Taxable income",{"$f":"I34","v":0},{"$f":"I34","v":0},{"$f":"I34","v":0},{"$f":"M5","v":"Below 60 Years"},null,{"$f":"I36","v":0},{"$f":"I36","v":0},{"$f":"I36","v":0},{"$f":"T70","v":"Below 60 Years"}]
[null,null,null,null,null,null,null,null,null,null,"basic deduction",250000,300000,500000,null,null,250000,300000,500000]
[null,null,null,null,null,null,null,null,null,null,"balance",{"$f":"L81-L82","v":-250000},{"$f":"M81-M82","v":-300000},{"$f":"N81-N82","v":-500000},null,null,{"$f":"Q81-Q82","v":-250000},{"$f":"R81-R82","v":-300000},{"$f":"S81-S82","v":-500000}]
[null,null,null,null,null,null,null,null,null,null,"stage 1",{"$f":"IF(L81<1,0,IF(L81>=500000,12500,L83*0.05))","v":0},{"$f":"IF(M81<1,0,IF(M81>=500000,10000,M83*0.05))","v":0},{"$f":"IF(N83<1,0,IF(N83<=500000,N83*0.2,100000))","v":0},null,null,{"$f":"IF(Q81<1,0,IF(Q81>=500000,12500,Q83*0.05))","v":0},{"$f":"IF(R81<1,0,IF(R81>=500000,10000,R83*0.05))","v":0},{"$f":"IF(S83<1,0,IF(S83<=500000,S83*0.2,100000))","v":0}]
[null,null,null,null,null,null,null,null,null,null,"stage 2",{"$f":"IF(L81<=500000,0,IF(L81<=1000000,(L81-500000)*0.2,IF(L81>1000000,100000)))","v":0},{"$f":"IF(M81<=500000,0,IF(M81<=1000000,(M81-500000)*0.2,IF(M81>1000000,100000)))","v":0},{"$f":"IF(N83>500000,(N83-500000)*0.3)","v":false},null,null,{"$f":"IF(Q81<=500000,0,IF(Q81<=1000000,(Q81-500000)*0.2,IF(Q81>1000000,100000)))","v":0},{"$f":"IF(R81<=500000,0,IF(R81<=1000000,(R81-500000)*0.2,IF(R81>1000000,100000)))","v":0},{"$f":"IF(S83>500000,(S83-500000)*0.3)","v":false}]
[null,null,null,null,null,null,null,null,null,null,"stage 3",{"$f":"IF(L81<=1000000,0,(L81-1000000)*0.3)","v":0},{"$f":"IF(M81<=1000000,0,(M81-1000000)*0.3)","v":0},{"$f":"IF(N81<=1000000,0,(N81-1000000)*0.3)","v":0},null,null,{"$f":"IF(Q81<=1000000,0,(Q81-1000000)*0.3)","v":0},{"$f":"IF(R81<=1000000,0,(R81-1000000)*0.3)","v":0},{"$f":"IF(S81<=1000000,0,(S81-1000000)*0.3)","v":0}]
[null,null,null,null,null,null,null,null,null,null,"tax",{"$f":"L84+L85+L86","v":0},{"$f":"M84+M85+M86","v":0},{"$f":"N84+N85+N86","v":0},null,null,{"$f":"Q84+Q85+Q86","v":0},{"$f":"R84+R85+R86","v":0},{"$f":"S84+S85+S86","v":0}]
[null,null,null,null,null,null,null,null,null,null,"TAX APPLICABLE ABOVE",{"$f":"IF(O81=\"BELOW 60 YEARS\",L87,IF(O81=\"60 TO 79 YEARS\",M87,IF(O81=\"80 AND ABOVE\",N87)))","v":0},null,null,null,null,{"$f":"IF(O81=\"BELOW 60 YEARS\",Q87,IF(O81=\"60 TO 79 YEARS\",R87,IF(O81=\"80 AND ABOVE\",S87)))","v":0}]
[]
[null,null,null,null,null,null,null,null,null,null,null,null,"2018-19 tax calculation receipt basis babu",null,null,null,"2018-19 tax calculation accrual babu"]
[null,null,null,null,null,null,null,null,null,null,null,"normal","SENIOR","super senior","TYPE OF PERSON",null,"normal","SENIOR","super senior","TYPE OF PERSON"]
[null,null,null,null,null,null,null,null,null,null,"Taxable income",{"$f":"H34","v":0},{"$f":"H34","v":0},{"$f":"H34","v":0},{"$f":"M5","v":"Below 60 Years"},null,{"$f":"H36","v":0},{"$f":"H36","v":0},{"$f":"H36","v":0},{"$f":"M5","v":"Below 60 Years"}]
[null,null,null,null,null,null,null,null,null,null,"basic deduction",250000,300000,500000,null,null,250000,300000,500000]
[null,null,null,null,null,null,null,null,null,null,"balance",{"$f":"L92-L93","v":-250000},{"$f":"M92-M93","v":-300000},{"$f":"N92-N93","v":-500000},null,null,{"$f":"Q92-Q93","v":-250000},{"$f":"R92-R93","v":-300000},{"$f":"S92-S93","v":-500000}]
[null,null,null,null,null,null,null,null,null,null,"stage 1",{"$f":"IF(L92<1,0,IF(L92>=500000,12500,L94*0.05))","v":0},{"$f":"IF(M92<1,0,IF(M92>=500000,10000,M94*0.05))","v":0},{"$f":"IF(N94<1,0,IF(N94<=500000,N94*0.2,100000))","v":0},null,null,{"$f":"IF(Q92<1,0,IF(Q92>=500000,12500,Q94*0.05))","v":0},{"$f":"IF(R92<1,0,IF(R92>=500000,10000,R94*0.05))","v":0},{"$f":"IF(S94<1,0,IF(S94<=500000,S94*0.2,100000))","v":0}]
[null,null,null,null,null,null,null,null,null,null,"stage 2",{"$f":"IF(L92<=500000,0,IF(L92<=1000000,(L92-500000)*0.2,IF(L92>1000000,100000)))","v":0},{"$f":"IF(M92<=500000,0,IF(M92<=1000000,(M92-500000)*0.2,IF(M92>1000000,100000)))","v":0},{"$f":"IF(N94>500000,(N94-500000)*0.3)","v":false},null,null,{"$f":"IF(Q92<=500000,0,IF(Q92<=1000000,(Q92-500000)*0.2,IF(Q92>1000000,100000)))","v":0},{"$f":"IF(R92<=500000,0,IF(R92<=1000000,(R92-500000)*0.2,IF(R92>1000000,100000)))","v":0},{"$f":"IF(S94>500000,(S94-500000)*0.3)","v":false}]
[null,null,null,null,null,null,null,null,null,null,"stage 3",{"$f":"IF(L92<=1000000,0,(L92-1000000)*0.3)","v":0},{"$f":"IF(M92<=1000000,0,(M92-1000000)*0.3)","v":0},{"$f":"IF(N92<=1000000,0,(N92-1000000)*0.3)","v":0},null,null,{"$f":"IF(Q92<=1000000,0,(Q92-1000000)*0.3)","v":0},{"$f":"IF(R92<=1000000,0,(R92-1000000)*0.3)","v":0},{"$f":"IF(S92<=1000000,0,(S92-1000000)*0.3)","v":0}]
[null,null,null,null,null,null,null,null,null,null,"tax",{"$f":"L95+L96+L97","v":0},{"$f":"M95+M96+M97","v":0},{"$f":"N95+N96+N97","v":0},null,null,{"$f":"Q95+Q96+Q97","v":0},{"$f":"R95+R96+R97","v":0},{"$f":"S95+S96+S97","v":0}]
[null,null,null,null,null,null,null,null,null,null,"TAX APPLICABLE ABOVE",{"$f":"IF(O92=\"BELOW 60 YEARS\",L98,IF(O92=\"60 TO 79 YEARS\",M98,IF(O92=\"80 AND ABOVE\",N98)))","v":0},null,null,null,null,{"$f":"IF(T92=\"BELOW 60 YEARS\",Q98,IF(T92=\"60 TO 79 YEARS\",R98,IF(T92=\"80 AND ABOVE\",S98)))","v":0}]
[]
[]
[null,null,null,null,null,null,null,null,null,null,null,null,"2019-20 tax calculation receipt basis babu",null,null,null,"2019-20 tax calculation accrual babu"]
[null,null,null,null,null,null,null,null,null,null,null,"normal","SENIOR","super senior","TYPE OF PERSON",null,"normal","SENIOR","super senior","TYPE OF PERSON"]
[null,null,null,null,null,null,null,null,null,null,"Taxable income",{"$f":"G34","v":0},{"$f":"G34","v":0},{"$f":"G34","v":0},{"$f":"M5","v":"Below 60 Years"},{"$f":"O104","v":"Below 60 Years"},{"$f":"$G$36","v":0},{"$f":"$G$36","v":0},{"$f":"$G$36","v":0},{"$f":"O104","v":"Below 60 Years"}]
[null,null,null,null,null,null,null,null,null,null,"basic deduction",250000,300000,500000,null,null,250000,300000,500000]
[null,null,null,null,null,null,null,null,null,null,"balance",{"$f":"L104-L105","v":-250000},{"$f":"M104-M105","v":-300000},{"$f":"N104-N105","v":-500000},null,null,{"$f":"Q104-Q105","v":-250000},{"$f":"R104-R105","v":-300000},{"$f":"S104-S105","v":-500000}]
[null,null,null,null,null,null,null,null,null,null,"stage 1",{"$f":"IF(L104<1,0,IF(L104>=500000,12500,L106*0.05))","v":0},{"$f":"IF(M104<1,0,IF(M104>=500000,10000,M106*0.05))","v":0},{"$f":"IF(N106<1,0,IF(N106<=500000,N106*0.2,100000))","v":0},null,null,{"$f":"IF(Q104<1,0,IF(Q104>=500000,12500,Q106*0.05))","v":0},{"$f":"IF(R104<1,0,IF(R104>=500000,10000,R106*0.05))","v":0},{"$f":"IF(S106<1,0,IF(S106<=500000,S106*0.2,100000))","v":0}]
[null,null,null,null,null,null,null,null,null,null,"stage 2",{"$f":"IF(L104<=500000,0,IF(L104<=1000000,(L104-500000)*0.2,IF(L104>1000000,100000)))","v":0},{"$f":"IF(M104<=500000,0,IF(M104<=1000000,(M104-500000)*0.2,IF(M104>1000000,100000)))","v":0},{"$f":"IF(N106>500000,(N106-500000)*0.3)","v":false},null,null,{"$f":"IF(Q104<=500000,0,IF(Q104<=1000000,(Q104-500000)*0.2,IF(Q104>1000000,100000)))","v":0},{"$f":"IF(R104<=500000,0,IF(R104<=1000000,(R104-500000)*0.2,IF(R104>1000000,100000)))","v":0},{"$f":"IF(S106>500000,(S106-500000)*0.3)","v":false}]
[null,null,null,null,null,null,null,null,null,null,"stage 3",{"$f":"IF(L104<=1000000,0,(L104-1000000)*0.3)","v":0},{"$f":"IF(M104<=1000000,0,(M104-1000000)*0.3)","v":0},{"$f":"IF(N104<=1000000,0,(N104-1000000)*0.3)","v":0},null,null,{"$f":"IF(Q104<=1000000,0,(Q104-1000000)*0.3)","v":0},{"$f":"IF(R104<=1000000,0,(R104-1000000)*0.3)","v":0},{"$f":"IF(S104<=1000000,0,(S104-1000000)*0.3)","v":0}]
[null,null,null,null,null,null,null,null,null,null,"tax",{"$f":"L107+L108+L109","v":0},{"$f":"M107+M108+M109","v":0},{"$f":"N107+N108+N109","v":0},null,null,{"$f":"Q107+Q108+Q109","v":0},{"$f":"R107+R108+R109","v":0},{"$f":"S107+S108+S109","v":0}]
[null,null,null,null,null,null,null,null,null,null,"TAX APPLICABLE ABOVE",{"$f":"IF(O104=\"BELOW 60 YEARS\",L110,IF(O104=\"60 TO 79 YEARS\",M110,IF(O104=\"80 AND ABOVE\",N110)))","v":0},{"$f":"IF(P104=\"BELOW 60 YEARS\",M110,IF(P104=\"60 TO 79 YEARS\",N110,IF(P104=\"80 AND ABOVE\",O110)))","v":0},null,null,null,{"$f":"IF(T104=\"BELOW 60 YEARS\",Q110,IF(T104=\"60 TO 79 YEARS\",R110,IF(T104=\"80 AND ABOVE\",S110)))","v":0}]
[]
[]
[null,null,null,null,null,null,null,null,null,null,"OLD REGIME",null,"2020-21 tax calculation receipt basis babu",null,null,"OLD REGIME","2020-21 tax calculation accrual babu",null,null,null,null,null,"NEW  REGIME","2020-21 tax calculation receipt basis babu",null,null,"NEW  REGIME","2020-21 tax calculation ACCRUAL BASIS"]
[null,null,null,null,null,null,null,null,null,null,null,"normal","SENIOR","super senior","TYPE OF PERSON",null,"normal","SENIOR","super senior","TYPE OF PERSON",null,null,"NORMAL",null,null,null,"NORMAL"]
[null,null,null,null,null,null,null,null,null,null,"Taxable income",{"$f":"F34","v":0},{"$f":"F34","v":0},{"$f":"F34","v":0},{"$f":"M5","v":"Below 60 Years"},{"$f":"O116","v":"Below 60 Years"},{"$f":"$F$36","v":0},{"$f":"$F$36","v":0},{"$f":"$F$36","v":0},{"$f":"O116","v":"Below 60 Years"},null,null,{"$f":"L116","v":0},null,null,null,{"$f":"$F$36","v":0}]
[null,null,null,null,null,null,null,null,null,null,"basic deduction",250000,300000,500000,null,null,250000,300000,500000]
[null,null,null,null,null,null,null,null,null,null,"balance",{"$f":"L116-L117","v":-250000},{"$f":"M116-M117","v":-300000},{"$f":"N116-N117","v":-500000},null,null,{"$f":"Q116-Q117","v":-250000},{"$f":"R116-R117","v":-300000},{"$f":"S116-S117","v":-500000}]
[null,null,null,null,null,null,null,null,null,null,"stage 1",{"$f":"IF(L116<1,0,IF(L116>=500000,12500,L118*0.05))","v":0},{"$f":"IF(M116<1,0,IF(M116>=500000,10000,M118*0.05))","v":0},{"$f":"IF(N118<1,0,IF(N118<=500000,N118*0.2,100000))","v":0},null,null,{"$f":"IF(Q116<1,0,IF(Q116>=500000,12500,Q118*0.05))","v":0},{"$f":"IF(R116<1,0,IF(R116>=500000,10000,R118*0.05))","v":0},{"$f":"IF(S118<1,0,IF(S118<=500000,S118*0.2,100000))","v":0}]
[null,null,null,null,null,null,null,null,null,null,"stage 2",{"$f":"IF(L116<=500000,0,IF(L116<=1000000,(L116-500000)*0.2,IF(L116>1000000,100000)))","v":0},{"$f":"IF(M116<=500000,0,IF(M116<=1000000,(M116-500000)*0.2,IF(M116>1000000,100000)))","v":0},{"$f":"IF(N118>500000,(N118-500000)*0.3)","v":false},null,null,{"$f":"IF(Q116<=500000,0,IF(Q116<=1000000,(Q116-500000)*0.2,IF(Q116>1000000,100000)))","v":0},{"$f":"IF(R116<=500000,0,IF(R116<=1000000,(R116-500000)*0.2,IF(R116>1000000,100000)))","v":0},{"$f":"IF(S118>500000,(S118-500000)*0.3)","v":false}]
[null,null,null,null,null,null,null,null,null,null,"stage 3",{"$f":"IF(L116<=1000000,0,(L116-1000000)*0.3)","v":0},{"$f":"IF(M116<=1000000,0,(M116-1000000)*0.3)","v":0},{"$f":"IF(N116<=1000000,0,(N116-1000000)*0.3)","v":0},null,null,{"$f":"IF(Q116<=1000000,0,(Q116-1000000)*0.3)","v":0},{"$f":"IF(R116<=1000000,0,(R116-1000000)*0.3)","v":0},{"$f":"IF(S116<=1000000,0,(S116-1000000)*0.3)","v":0}]
[null,null,null,null,null,null,null,null,null,null,"tax",{"$f":"L119+L120+L121","v":0},{"$f":"M119+M120+M121","v":0},{"$f":"N119+N120+N121","v":0},null,null,{"$f":"Q119+Q120+Q121","v":0},{"$f":"R119+R120+R121","v":0},{"$f":"S119+S120+S121","v":0},null,null,null,{"$f":"IF(W116<250001,0,IF(W116<500001,(W116-250000)/20,IF(W116<750001,(12500+(W116-500000)/10),IF(W116<1000001,(37500+(W116-750000)*15/100),IF(W116<1250001,75000+(W116-1000000)/5,IF(W116<1500001,125000+(W116-1250000)/4,187500+(W116-1500000)*30/100))))))","v":0},null,null,null,{"$f":"IF(AA116<250001,0,IF(AA116<500001,(AA116-250000)/20,IF(AA116<750001,(12500+(AA116-500000)/10),IF(AA116<1000001,(37500+(AA116-750000)*15/100),IF(AA116<1250001,75000+(AA116-1000000)/5,IF(AA116<1500001,125000+(AA116-1250000)/4,187500+(AA116-1500000)*30/100))))))","v":0}]
[null,null,null,null,null,null,null,null,null,null,"TAX APPLICABLE ABOVE",{"$f":"IF(O116=\"BELOW 60 YEARS\",L122,IF(O116=\"60 TO 79 YEARS\",M122,IF(O116=\"80 AND ABOVE\",N122)))","v":0},{"$f":"IF(P116=\"BELOW 60 YEARS\",M122,IF(P116=\"60 TO 79 YEARS\",N122,IF(P116=\"80 AND ABOVE\",O122)))","v":0},null,null,null,{"$f":"IF(T116=\"BELOW 60 YEARS\",Q122,IF(T116=\"60 TO 79 YEARS\",R122,IF(T116=\"80 AND ABOVE\",S122)))","v":0}]
[]
[]
[null,null,null,null,null,null,null,null,null,null,"OLD REGIME",null,"2021-22 TAX CALCULATION RECEIPT BASIS BABU",null,null,"OLD REGIME","2021-22 tax calculation accrual babu",null,null,null,null,null,"NEW REGIME","2021-22 tax calculation receipt basis"]
[null,null,null,null,null,null,null,null,null,null,null,"normal","SENIOR","SUPER SENIOR","TYPE OF PERSON",null,"NORMAL","SENIOR","SUPER SENIOR","TYPE OF PERSON",null,null,"NORMAL"]
[null,null,null,null,null,null,null,null,null,null,"TAXABLE INCOME",{"$f":"E34","v":2}]
[null,null,null,null,null,null,null,null,null,null,null,25000]
[]
[]
[]
[]
[]
[]
[]
[]
[]
[null,"FY","Slab",null,null,null,null,null,null,"Below 60","Senior citizen",null,"Super senior citizen","Rate","Cess"]
[null,"2006-07 ","Up to Rs 1 Lakh ",null,null,null,null,null,null,"Up to Rs.1.35 Lakh ","Up to Rs.1.85 lakhs ",null,"Up to Rs.1.85 lakhs ","Nil ","Surcharge @ 10% if Income >Rs. 10 lakh, edu cess @ 2% on IT"]
[null,null,"1,00,001 - 1,50,000 ",null,null,null,null,null,null,"1,35,000-1,50,000 ","NIL",null,"NIL",0.1]
[null,null,"1,50,001-2,50,000 ",null,null,null,null,null,null,"1,50,001-2,50,000 ","1,85,001-2,50,000 ",null,"1,85,001-2,50,000 ",0.2]
[null,null,"More than Rs.2,50,000 ",null,null,null,null,null,null,"More than Rs.2,50,000 ","More than Rs.2,50,000 ",null,"More than Rs.2,50,000 ",0.3]
[]
[null,"2007-08 ","Up to Rs.1.10 Lakh ",null,null,null,null,null,null,"Up to Rs.1.45 Lakh ","Up to Rs.1.95 lakhs ",null,"Up to Rs.1.95 lakhs ","Nil ","Surcharge @ 10% if Income >Rs. 10 lakh, edu cess @ 3% on IT"]
[null,null,"1,10,001-1,50,000 ",null,null,null,null,null,null,"1,45,001-1,50,000 ","NIL",null,"NIL",0.1]
[null,null,"1,50,001-2,50,000 ",null,null,null,null,null,null,"1,50,001-2,50,000 ","1,95,001-2,50,000 ",null,"1,95,001-2,50,000 ",0.2]
[null,null,"More than Rs.2,50,000 ",null,null,null,null,null,null,"More than Rs.2,50,000 ","More than Rs.2,50,000 ",null,"More than Rs.2,50,000 ",0.3]
[]
[null,"2008-09 ","Up to Rs.1.50 lakh ",null,null,null,null,null,null,"Up to Rs.1.80 lakh ","Up to Rs.2.25 lakh ",null,"Up to Rs.2.25 lakh ","Nil ","Surcharge @ 10% if Income >Rs. 10 lakh, edu cess @ 3% on IT"]
[null,null,"1,50,001-3,00,000 ",null,null,null,null,null,null,"1,80,001-3,00,000 ","2,25,001-3,00,000 ",null,"2,25,001-3,00,000 ",0.1]
[null,null,"3,00,001-5,00,000 ",null,null,null,null,null,null,"3,00,001-5,00,000 ","3,00,001-5,00,000 ",null,"3,00,001-5,00,000 ",0.2]
[null,null,"More than Rs.5 lakh ",null,null,null,null,null,null,"More than Rs.5 lakh ","More than Rs.5 lakh ",null,"More than Rs.5 lakh ",0.3]
[]
[null,"2009-10 ","Up to Rs.1.60 lakh ",null,null,null,null,null,null,"Up to Rs.1.90 lakh ","Up to Rs.2.40 lakh ",null,"Up to Rs.2.40 lakh ","Nil ","Cess @3% on Tax"]
[null,null,"1,60,001-3,00,000 ",null,null,null,null,null,null,"1,90,001-3,00,000 ","2,40,001-3,00,000 ",null,"2,40,001-3,00,000 ",0.1]
[null,null,"3,00,001-5,00,000 ",null,null,null,null,null,null,"3,00,001-5,00,000 ","3,00,001-5,00,000 ",null,"3,00,001-5,00,000 ",0.2]
[null,null,"More than Rs.5 lakh ",null,null,null,null,null,null,"More than Rs.5 lakh ","More than Rs.5 lakh ",null,"More than Rs.5 lakh ",0.3]
[]
[null,"2010-11 ","Up to Rs.1.60 lakh ",null,null,null,null,null,null,"Up to Rs.1.90 lakh ","Up to Rs.2.40 lakh ",null,"Up to Rs.2.40 lakh ","Nil ","Cess @3% on Tax"]
[null,null,"1,60,001-5,00,000 ",null,null,null,null,null,null,"1,90,001-5,00,000 ","2,40,001-5,00,000 ",null,"2,40,001-5,00,000 ",0.1]
[null,null,"5,00,001-8,00,000 ",null,null,null,null,null,null,"5,00,001-8,00,000 ","5,00,001-8,00,000 ",null,"5,00,001-8,00,000 ",0.2]
[null,null,"More than Rs.8 lakh ",null,null,null,null,null,null,"More than Rs.8 lakh ","More than Rs.8 lakh ",null,"More than Rs.8 lakh ",0.3]
[]
[null,"2011-12 ","Up to Rs. 1,80,000",null,null,null,null,null,null,"Up to Rs. 1,90,000 ","Up to Rs. 2,50,000 ",null,"Up to Rs. 2,50,000 ","Nil ","Cess @3% on Tax"]
[null,null,"1,80,001-5,00,000 ",null,null,null,null,null,null,"1,90,001-5,00,000 ","2,50,001-5,00,000 ",null,"2,50,001-5,00,000 ",0.1]
[null,null,"5,00,001-8,00,000 ",null,null,null,null,null,null,"5,00,001-8,00,000 ","5,00,001-8,00,000 ",null,"5,00,001-8,00,000 ",0.2]
[null,null,"More than Rs.8 lakh ",null,null,null,null,null,null,"More than Rs.8 lakh ","More than Rs.8 lakh ",null,"More than Rs.8 lakh ",0.3]
[]
[null,"2012-13 ","Up to Rs. 2,00,000",null,null,null,null,null,null,"Up to Rs. 2,00,000","Up to Rs. 2,50,000",null,"Up to Rs. 5,00,000","Nil ","Cess @3% on Tax"]
[null,null,"2,00,001-5,00,000 ",null,null,null,null,null,null,"2,00,001-5,00,000 ","2,50,001-5,00,000 ",null,null,0.1]
[null,null,"5,00,001-10,00,000 ",null,null,null,null,null,null,"5,00,001-10,00,00","5,00,001-10,00,00",null,"5,00,001-10,00,00",0.2]
[null,null,"More than Rs.10 lakh ",null,null,null,null,null,null,"More than Rs.10 lakh ","More than Rs.10 lakh ",null,"More than Rs.10 lakh ",0.3]
[]
[null,"2013-14 ","Up to Rs. 2,00,000",null,null,null,null,null,null,"Up to Rs. 2,00,000","Up to Rs. 2,50,000",null,"Up to Rs. 5,00,000","Nil ","Cess @3% on Tax"]
[null,null,"2,00,001-5,00,000 ",null,null,null,null,null,null,"2,00,001-5,00,000 ","2,50,001-5,00,000 ",null,null,0.1]
[null,null,"5,00,001-10,00,000 ",null,null,null,null,null,null,"5,00,001-10,00,00","5,00,001-10,00,00",null,"5,00,001-10,00,00",0.2]
[null,null,"More than Rs.10 lakh ",null,null,null,null,null,null,"More than Rs.10 lakh ","More than Rs.10 lakh ",null,"More than Rs.10 lakh ",0.3]
[null,null,"A maximum rebate of Rs. 2000 is allowed if Total Income does not exceed Rs.5 Lakhs (87 A)"]
[]
[null,"2014-15","Up to Rs. 2,50,000",null,null,null,null,null,null,"Up to Rs. 2,50,000","Up to Rs. 3,00,000",null,"Up to Rs. 5,00,000","Nil ","Cess @3% on Tax"]
[null,null,"2,50,001-5,00,000 ",null,null,null,null,null,null,"2,50,001-5,00,000 ","3,00,001-5,00,000 ",null,null,0.1]
[null,null,"5,00,001-10,00,000 ",null,null,null,null,null,null,"5,00,001-10,00,00","5,00,001-10,00,00",null,"5,00,001-10,00,00",0.2]
[null,null,"More than Rs.10 lakh ",null,null,null,null,null,null,"More than Rs.10 lakh ","More than Rs.10 lakh ",null,"More than Rs.10 lakh ",0.3]
[null,null,"A maximum rebate of Rs. 2000 is allowed if Total Income does not exceed Rs.5 Lakhs  (87 A)"]
[]
[null,"2015-16","Up to Rs. 2,50,000",null,null,null,null,null,null,"Up to Rs. 2,50,000","Up to Rs. 3,00,000",null,"Up to Rs. 5,00,000","Nil ","Cess @3% on Tax"]
[null,null,"2,50,001-5,00,000 ",null,null,null,null,null,null,"2,50,001-5,00,000 ","3,00,001-5,00,000 ",null,null,0.1]
[null,null,"5,00,001-10,00,000 ",null,null,null,null,null,null,"5,00,001-10,00,00","5,00,001-10,00,00",null,"5,00,001-10,00,00",0.2]
[null,null,"More than Rs.10 lakh ",null,null,null,null,null,null,"More than Rs.10 lakh ","More than Rs.10 lakh ",null,"More than Rs.10 lakh ",0.3]
[null,null,"A maximum rebate of Rs. 2000 is allowed if Total Income does not exceed Rs.5 Lakhs  (87 A)"]
[]
[null,"2016-17","Up to Rs. 2,50,000",null,null,null,null,null,null,"Up to Rs. 2,50,000","Up to Rs. 3,00,000",null,"Up to Rs. 5,00,000","Nil ","Cess @3% on Tax"]
[null,null,"2,50,001-5,00,000 ",null,null,null,null,null,null,"2,50,001-5,00,000 ","3,00,001-5,00,000 ",null,null,0.1]
[null,null,"5,00,001-10,00,000 ",null,null,null,null,null,null,"5,00,001-10,00,00","5,00,001-10,00,00",null,"5,00,001-10,00,00",0.2]
[null,null,"More than Rs.10 lakh ",null,null,null,null,null,null,"More than Rs.10 lakh ","More than Rs.10 lakh ",null,"More than Rs.10 lakh ",0.3]
[null,null,"A maximum rebate of Rs. 5000 is allowed if Total Income does not exceed Rs.5 Lakhs"]
[]
[null,"2017-18","Up to Rs. 2,50,000",null,null,null,null,null,null,"Up to Rs. 2,50,000","Up to Rs. 3,00,000",null,"Up to Rs. 5,00,000","Nil ","Cess @3% on Tax"]
[null,null,"2,50,001-5,00,000 ",null,null,null,null,null,null,"2,50,001-5,00,000 ","3,00,001-5,00,000 ",null,null,0.05]
[null,null,"5,00,001-10,00,000 ",null,null,null,null,null,null,"5,00,001-10,00,00","5,00,001-10,00,00",null,"5,00,001-10,00,00",0.2]
[null,null,"More than Rs.10 lakh ",null,null,null,null,null,null,"More than Rs.10 lakh ","More than Rs.10 lakh ",null,"More than Rs.10 lakh ",0.3]
[null,null,"A maximum rebate of Rs. 2500 is allowed if Total Income does not exceed Rs.3.5 Lakhs"]
[]
[null,"2018-19","Up to Rs. 2,50,000",null,null,null,null,null,null,"Up to Rs. 2,50,000","Up to Rs. 3,00,000",null,"Up to Rs. 5,00,000","Nil ","Health & Education cess @ 4% on IT, Surcharge @12%, if income > 1 Crore"]
[null,null,"2,50,001-5,00,000 ",null,null,null,null,null,null,"2,50,001-5,00,000 ","3,00,001-5,00,000 ",null,null,0.05]
[null,null,"5,00,001-10,00,000 ",null,null,null,null,null,null,"5,00,001-10,00,00","5,00,001-10,00,00",null,"5,00,001-10,00,00",0.2]
[null,null,"More than Rs.10 lakh ",null,null,null,null,null,null,"More than Rs.10 lakh ","More than Rs.10 lakh ",null,"More than Rs.10 lakh ",0.3]
[null,null,"Std Dedction Rs.40,000 & A maximum rebate of Rs. 2500 is allowed if Total Income does not exceed Rs.3.5 Lakhs"]
[]
[null,"2019-20","Up to Rs. 2,50,000",null,null,null,null,null,null,"Up to Rs. 2,50,000","Up to Rs. 3,00,000",null,"Up to Rs. 5,00,000","Nil ","Health & Education cess @ 4% on IT, Surcharge @12%, if income > 1 Crore"]
[null,null,"2,50,001-5,00,000 ",null,null,null,null,null,null,"2,50,001-5,00,000 ","3,00,001-5,00,000 ",null,null,0.05]
[null,null,"5,00,001-10,00,000 ",null,null,null,null,null,null,"5,00,001-10,00,00","5,00,001-10,00,00",null,"5,00,001-10,00,00",0.2]
[null,null,"More than Rs.10 lakh ",null,null,null,null,null,null,"More than Rs.10 lakh ","More than Rs.10 lakh ",null,"More than Rs.10 lakh ",0.3]
[null,null,"Std Dedction Rs.50,000 & A maximum rebate of Rs. 12500 is allowed if Total Income does not exceed Rs.5 Lakhs"]

{"sheet":"SAVEHELP","index":27,"n_rows":19,"n_cols":15,"rows_kept":19,"cut":false,"hidden":false,"merged":[]}
[{"$f":"PERSONAL!H4&\"- 2024- ECTAX MALAYALAM- DATA \"","v":"- 2024- ECTAX MALAYALAM- DATA "}]
[{"$f":"\"Now you are considering the file of \"& PERSONAL!H4","v":"Now you are considering the file of "},null,null,null,null,null,null,null,null,null,null,null,null,null,"CLICK THE FOLLOWING BUTTONS"]
[null,"CLICK THE SQUARE PICTURE TO SAVE THE DOCUMENT, BUT READ INSTRUCTIONS FIRST ",null,null,null,null,null,null,null,null,null,null,null,null,"To download Income tax notes"]
[]
[null,null,null,null,null,null,null,null,null,null,null,null,null,null,"To visit Web/ download latest version if any"]
[]
[null,null,null,null,null,null,null,null,null,null,null,null,null,null,"To visit Ectax FB"]
[]
[null,null,null,null,null,null,null,null,null,null,null,null,null,null,{"$f":"\"To know how \"&PERSONAL!H4&\"'s tax is calculated\"","v":"To know how 's tax is calculated"}]
[]
[null,{"$f":"\"ആ ഫയലിന്റെ പേര് \"&A1&\" എന്നായിരിക്കും\"","v":"ആ ഫയലിന്റെ പേര് - 2024- ECTAX MALAYALAM- DATA  എന്നായിരിക്കും"}]
[null,null,null,null,null,null,null,null,null,null,null,null,null,null,"To view tax rates of previous periods"]
[]
[null,null,null,null,null,null,null,null,null,null,null,null,null,null,"Comment on Whatsapp 9947009559"]
[]
[null,null,null,null,null,null,null,null,null,null,null,null,null,null,"Mail your comments to babuvadukkumchery@gmail.com"]
[]
[null,null,null,null,null,null,null,null,null,null,null,null,null,null,"10 -E Calculation guidelines download"]
[null,null,null,null,null,null,null,null,null,null,null,null,null,null,"Help Viedo Youtube"]